BDBM50176387 2-hydroxy-4-diethylaminobenzaldehyde 4-tert-butyl-benzoyl hydrazone::CHEMBL200801
SMILES: CCN(CC)c1ccc(C=NNC(=O)c2ccc(cc2)C(C)(C)C)c(O)c1
InChI Key: InChIKey=OQAZYWVBNPEOIH-UHFFFAOYSA-N
Data: 1 IC50
Activity Spreadsheet -- Enzyme Inhibition Constant Data from BindingDB
Found 1 hit for monomerid = 50176387
Trg + Lig
Ki
nM
ΔG°
kcal/mole
IC50
nM
Kd
nM
EC50/IC50
nM
koff
s-1
kon
M-1s-1
pHTemp
°C
Histidine-rich protein
(Plasmodium falciparum)
BDBM50176387
(2-hydroxy-4-diethylaminobenzaldehyde 4-tert-butyl-...)
Show SMILES CCN(CC)c1ccc(C=NNC(=O)c2ccc(cc2)C(C)(C)C)c(O)c1 |w:9.8|
Show InChI InChI=1S/C22H29N3O2/c1-6-25(7-2)19-13-10-17(20(26)14-19)15-23-24-21(27)16-8-11-18(12-9-16)22(3,4)5/h8-15,26H,6-7H2,1-5H3,(H,24,27)
n/an/a>1.00E+5n/an/an/an/an/an/a
Universit£ de Lille II
Curated by ChEMBL
Assay Description
Inhibition of 1-monooleoyl glycerol induced beta-hematin formation
Bioorg Med Chem Lett 16: 31-5 (2005)
Article DOI: 10.1016/j.bmcl.2005.09.058
BindingDB Entry DOI: 10.7270/Q2K35VWT