BDBM50176427 CHEMBL202013::N-(6-(4-chlorophenyl)-7-(2,4-dichlorophenyl)-1,3-dimethyl-2-oxo-1,2-dihydro-1,8-naphthyridin-4-yl)acetamide
SMILES: CC(=O)Nc1c(C)c(=O)n(C)c2nc(-c3ccc(Cl)cc3Cl)c(cc12)-c1ccc(Cl)cc1
InChI Key: InChIKey=MHXCSCGWSMXWKK-UHFFFAOYSA-N
Data: 2 IC50
Activity Spreadsheet -- Enzyme Inhibition Constant Data from BindingDB
Found 2 hits for monomerid = 50176427
Trg + Lig
Ki
nM
ΔG°
kcal/mole
IC50
nM
Kd
nM
EC50/IC50
nM
koff
s-1
kon
M-1s-1
pHTemp
°C
Cannabinoid receptor 2
(Homo sapiens (Human))
BDBM50176427
(CHEMBL202013 | N-(6-(4-chlorophenyl)-7-(2,4-dichlo...)
Show SMILES CC(=O)Nc1c(C)c(=O)n(C)c2nc(-c3ccc(Cl)cc3Cl)c(cc12)-c1ccc(Cl)cc1
Show InChI InChI=1S/C24H18Cl3N3O2/c1-12-21(28-13(2)31)19-11-18(14-4-6-15(25)7-5-14)22(29-23(19)30(3)24(12)32)17-9-8-16(26)10-20(17)27/h4-11H,1-3H3,(H,28,31)
Reactome pathway
n/an/a 1.50E+3n/an/an/an/an/an/a
Merck Research Laboratories
Curated by ChEMBL
Assay Description
Binding affinity at the CB2 receptor
Bioorg Med Chem Lett 16: 681-5 (2005)
Article DOI: 10.1016/j.bmcl.2005.10.028
BindingDB Entry DOI: 10.7270/Q2PZ58CM
Cannabinoid receptor 1
(Homo sapiens (Human))
BDBM50176427
(CHEMBL202013 | N-(6-(4-chlorophenyl)-7-(2,4-dichlo...)
Show SMILES CC(=O)Nc1c(C)c(=O)n(C)c2nc(-c3ccc(Cl)cc3Cl)c(cc12)-c1ccc(Cl)cc1
Show InChI InChI=1S/C24H18Cl3N3O2/c1-12-21(28-13(2)31)19-11-18(14-4-6-15(25)7-5-14)22(29-23(19)30(3)24(12)32)17-9-8-16(26)10-20(17)27/h4-11H,1-3H3,(H,28,31)
NCI pathway
Reactome pathway
n/an/a 26n/an/an/an/an/an/a
Merck Research Laboratories
Curated by ChEMBL
Assay Description
Binding affinity at the CB1 receptor
Bioorg Med Chem Lett 16: 681-5 (2005)
Article DOI: 10.1016/j.bmcl.2005.10.028
BindingDB Entry DOI: 10.7270/Q2PZ58CM