BDBM50176428 3-acetyl-6-(4-chlorophenyl)-7-(2,4-dichlorophenyl)-4-(dimethylamino)-1-methyl-1,8-naphthyridin-2(1H)-one::CHEMBL370388
SMILES: CN(C)c1c(C(C)=O)c(=O)n(C)c2nc(-c3ccc(Cl)cc3Cl)c(cc12)-c1ccc(Cl)cc1
InChI Key: InChIKey=UWQVZDDDOKWIOS-UHFFFAOYSA-N
Data: 2 IC50
Activity Spreadsheet -- Enzyme Inhibition Constant Data from BindingDB
Found 2 hits for monomerid = 50176428
Trg + Lig
Ki
nM
ΔG°
kcal/mole
IC50
nM
Kd
nM
EC50/IC50
nM
koff
s-1
kon
M-1s-1
pHTemp
°C
Cannabinoid receptor 2
(Homo sapiens (Human))
BDBM50176428
(3-acetyl-6-(4-chlorophenyl)-7-(2,4-dichlorophenyl)...)
Show SMILES CN(C)c1c(C(C)=O)c(=O)n(C)c2nc(-c3ccc(Cl)cc3Cl)c(cc12)-c1ccc(Cl)cc1
Show InChI InChI=1S/C25H20Cl3N3O2/c1-13(32)21-23(30(2)3)19-12-18(14-5-7-15(26)8-6-14)22(29-24(19)31(4)25(21)33)17-10-9-16(27)11-20(17)28/h5-12H,1-4H3
Reactome pathway
n/an/a 1.40E+3n/an/an/an/an/an/a
Merck Research Laboratories
Curated by ChEMBL
Assay Description
Binding affinity at the CB2 receptor
Bioorg Med Chem Lett 16: 681-5 (2005)
Article DOI: 10.1016/j.bmcl.2005.10.028
BindingDB Entry DOI: 10.7270/Q2PZ58CM
Cannabinoid receptor 1
(Homo sapiens (Human))
BDBM50176428
(3-acetyl-6-(4-chlorophenyl)-7-(2,4-dichlorophenyl)...)
Show SMILES CN(C)c1c(C(C)=O)c(=O)n(C)c2nc(-c3ccc(Cl)cc3Cl)c(cc12)-c1ccc(Cl)cc1
Show InChI InChI=1S/C25H20Cl3N3O2/c1-13(32)21-23(30(2)3)19-12-18(14-5-7-15(26)8-6-14)22(29-24(19)31(4)25(21)33)17-10-9-16(27)11-20(17)28/h5-12H,1-4H3
NCI pathway
Reactome pathway
n/an/a 96n/an/an/an/an/an/a
Merck Research Laboratories
Curated by ChEMBL
Assay Description
Binding affinity at the CB1 receptor
Bioorg Med Chem Lett 16: 681-5 (2005)
Article DOI: 10.1016/j.bmcl.2005.10.028
BindingDB Entry DOI: 10.7270/Q2PZ58CM