BDBM50176489 (5,8-dichloro-1-propyl-3,4-dihydro-1H-benzo[4,5]furo[2,3-c]pyran-1-yl)-acetic acid::CHEMBL200616
SMILES: CCCC1(CC(O)=O)OCCc2c1oc1c(Cl)ccc(Cl)c21
InChI Key: InChIKey=CXFDUKPPFNLZQM-UHFFFAOYSA-N
Data: 1 IC50
Activity Spreadsheet -- Enzyme Inhibition Constant Data from BindingDB
Found 1 hit for monomerid = 50176489
Trg + Lig
Ki
nM
ΔG°
kcal/mole
IC50
nM
Kd
nM
EC50/IC50
nM
koff
s-1
kon
M-1s-1
pHTemp
°C
Hepatitis C virus NS5B RNA-dependent RNA polymerase
(Hepatitis C virus)
BDBM50176489
((5,8-dichloro-1-propyl-3,4-dihydro-1H-benzo[4,5]fu...)
Show SMILES CCCC1(CC(O)=O)OCCc2c1oc1c(Cl)ccc(Cl)c21
Show InChI InChI=1S/C16H16Cl2O4/c1-2-6-16(8-12(19)20)15-9(5-7-21-16)13-10(17)3-4-11(18)14(13)22-15/h3-4H,2,5-8H2,1H3,(H,19,20)
n/an/a 1.49E+3n/an/an/an/an/an/a
Wyeth Research
Curated by ChEMBL
Assay Description
Displacement of [alpha-32P]GTP from recombinant HCV NS5B RNA dependent RNA polymerase
Bioorg Med Chem Lett 16: 457-60 (2005)
Article DOI: 10.1016/j.bmcl.2005.08.114
BindingDB Entry DOI: 10.7270/Q25X28H8