BDBM50176604 2-(3-((2-fluoro-4-(trifluoromethyl)benzyl)carbamoyl)-4-methoxybenzyl)butanoic acid::CHEMBL201832
SMILES: CCC(Cc1ccc(OC)c(c1)C(=O)NCc1ccc(cc1F)C(F)(F)F)C(O)=O
InChI Key: InChIKey=GJONLXVNIVHKMN-UHFFFAOYSA-N
Data: 3 EC50
Activity Spreadsheet -- Enzyme Inhibition Constant Data from BindingDB
Found 3 hits for monomerid = 50176604
Trg + Lig
Ki
nM
ΔG°
kcal/mole
IC50
nM
Kd
nM
EC50/IC50
nM
koff
s-1
kon
M-1s-1
pHTemp
°C
Peroxisome proliferator-activated receptor
(Homo sapiens (Human))
BDBM50176604
(2-(3-((2-fluoro-4-(trifluoromethyl)benzyl)carbamoy...)
Show SMILES CCC(Cc1ccc(OC)c(c1)C(=O)NCc1ccc(cc1F)C(F)(F)F)C(O)=O
Show InChI InChI=1S/C21H21F4NO4/c1-3-13(20(28)29)8-12-4-7-18(30-2)16(9-12)19(27)26-11-14-5-6-15(10-17(14)22)21(23,24)25/h4-7,9-10,13H,3,8,11H2,1-2H3,(H,26,27)(H,28,29)
NCI pathway
Reactome pathway
n/an/an/an/a 500n/an/an/an/a
University of Tokyo
Curated by ChEMBL
Assay Description
Agonist activity at PPARgamma transfected in HEK293 cells
Bioorg Med Chem Lett 16: 554-8 (2005)
Article DOI: 10.1016/j.bmcl.2005.10.049
BindingDB Entry DOI: 10.7270/Q2DF6QS3
Peroxisome proliferator-activated receptor alpha (PPAR alpha)
(Homo sapiens (Human))
BDBM50176604
(2-(3-((2-fluoro-4-(trifluoromethyl)benzyl)carbamoy...)
Show SMILES CCC(Cc1ccc(OC)c(c1)C(=O)NCc1ccc(cc1F)C(F)(F)F)C(O)=O
Show InChI InChI=1S/C21H21F4NO4/c1-3-13(20(28)29)8-12-4-7-18(30-2)16(9-12)19(27)26-11-14-5-6-15(10-17(14)22)21(23,24)25/h4-7,9-10,13H,3,8,11H2,1-2H3,(H,26,27)(H,28,29)
n/an/an/an/a 20n/an/an/an/a
University of Tokyo
Curated by ChEMBL
Assay Description
Agonist activity at PPARalpha transfected in HEK293 cells
Bioorg Med Chem Lett 16: 554-8 (2005)
Article DOI: 10.1016/j.bmcl.2005.10.049
BindingDB Entry DOI: 10.7270/Q2DF6QS3
Peroxisome proliferator-activated receptor delta
(Homo sapiens (Human))
BDBM50176604
(2-(3-((2-fluoro-4-(trifluoromethyl)benzyl)carbamoy...)
Show SMILES CCC(Cc1ccc(OC)c(c1)C(=O)NCc1ccc(cc1F)C(F)(F)F)C(O)=O
Show InChI InChI=1S/C21H21F4NO4/c1-3-13(20(28)29)8-12-4-7-18(30-2)16(9-12)19(27)26-11-14-5-6-15(10-17(14)22)21(23,24)25/h4-7,9-10,13H,3,8,11H2,1-2H3,(H,26,27)(H,28,29)
n/an/an/an/a 1.00E+3n/an/an/an/a
University of Tokyo
Curated by ChEMBL
Assay Description
Agonist activity at PPARdelta transfected in HEK293 cells
Bioorg Med Chem Lett 16: 554-8 (2005)
Article DOI: 10.1016/j.bmcl.2005.10.049
BindingDB Entry DOI: 10.7270/Q2DF6QS3