BDBM50176961 11-(2-hexyl-5-hydroxyphenoxy)undecanoic acid (4-hydroxyphenyl)amide::CHEMBL223223
SMILES: CCCCCCc1ccc(O)cc1OCCCCCCCCCCC(=O)Nc1ccc(O)cc1
InChI Key: InChIKey=SBZUBYZOOZUSIW-UHFFFAOYSA-N
Data: 2 KI  1 IC50
Activity Spreadsheet -- Enzyme Inhibition Constant Data from BindingDB
Found 3 hits for monomerid = 50176961
Trg + Lig
Ki
nM
ΔG°
kcal/mole
IC50
nM
Kd
nM
EC50/IC50
nM
koff
s-1
kon
M-1s-1
pHTemp
°C
Cannabinoid receptor 2
(Homo sapiens (Human))
BDBM50176961
(11-(2-hexyl-5-hydroxyphenoxy)undecanoic acid (4-hy...)
Show SMILES CCCCCCc1ccc(O)cc1OCCCCCCCCCCC(=O)Nc1ccc(O)cc1
Show InChI InChI=1S/C29H43NO4/c1-2-3-4-11-14-24-16-19-27(32)23-28(24)34-22-13-10-8-6-5-7-9-12-15-29(33)30-25-17-20-26(31)21-18-25/h16-21,23,31-32H,2-15,22H2,1H3,(H,30,33)
Reactome pathway
2.11E+3n/an/an/an/an/an/an/an/a
Universit£ degli Studi di Siena
Curated by ChEMBL
Assay Description
Displacement of [3H]CP-55940 from human CB2 receptor expressed in COS cells
J Med Chem 48: 7343-50 (2005)
Article DOI: 10.1021/jm0501533
BindingDB Entry DOI: 10.7270/Q2FX7B7W
Cannabinoid receptor 1
(Homo sapiens (Human))
BDBM50176961
(11-(2-hexyl-5-hydroxyphenoxy)undecanoic acid (4-hy...)
Show SMILES CCCCCCc1ccc(O)cc1OCCCCCCCCCCC(=O)Nc1ccc(O)cc1
Show InChI InChI=1S/C29H43NO4/c1-2-3-4-11-14-24-16-19-27(32)23-28(24)34-22-13-10-8-6-5-7-9-12-15-29(33)30-25-17-20-26(31)21-18-25/h16-21,23,31-32H,2-15,22H2,1H3,(H,30,33)
NCI pathway
Reactome pathway
3.30E+3n/an/an/an/an/an/an/an/a
Universit£ degli Studi di Siena
Curated by ChEMBL
Assay Description
Displacement of [3H]CP-55940 from human CB1 receptor expressed in COS cells
J Med Chem 48: 7343-50 (2005)
Article DOI: 10.1021/jm0501533
BindingDB Entry DOI: 10.7270/Q2FX7B7W
Fatty-acid amide hydrolase 1 (aa 30-579)
(Rattus norvegicus (rat))
BDBM50176961
(11-(2-hexyl-5-hydroxyphenoxy)undecanoic acid (4-hy...)
Show SMILES CCCCCCc1ccc(O)cc1OCCCCCCCCCCC(=O)Nc1ccc(O)cc1
Show InChI InChI=1S/C29H43NO4/c1-2-3-4-11-14-24-16-19-27(32)23-28(24)34-22-13-10-8-6-5-7-9-12-15-29(33)30-25-17-20-26(31)21-18-25/h16-21,23,31-32H,2-15,22H2,1H3,(H,30,33)
n/an/a 1.80E+4n/an/an/an/an/an/a
Universit£ degli Studi di Siena
Curated by ChEMBL
Assay Description
Inhibition of rat brain FAAH assessed as [14C]anandamide hydrolysis
J Med Chem 48: 7343-50 (2005)
Article DOI: 10.1021/jm0501533
BindingDB Entry DOI: 10.7270/Q2FX7B7W