BDBM50177062 9-dimethylamino-3-(4-methylphenyl)-3H-5-thia-1,3,7-triazafluoren-4-one::CHEMBL223869
SMILES: CN(C)c1cncc2sc3c(ncn(-c4ccc(C)cc4)c3=O)c12
InChI Key: InChIKey=LPWKFUVWWQYLOD-UHFFFAOYSA-N
Data: 2 IC50
Activity Spreadsheet -- Enzyme Inhibition Constant Data from BindingDB
Found 2 hits for monomerid = 50177062
Trg + Lig
Ki
nM
ΔG°
kcal/mole
IC50
nM
Kd
nM
EC50/IC50
nM
koff
s-1
kon
M-1s-1
pHTemp
°C
Metabotropic glutamate receptor 5
(Homo sapiens (Human))
BDBM50177062
(9-dimethylamino-3-(4-methylphenyl)-3H-5-thia-1,3,7...)
Show SMILES CN(C)c1cncc2sc3c(ncn(-c4ccc(C)cc4)c3=O)c12
Show InChI InChI=1S/C18H16N4OS/c1-11-4-6-12(7-5-11)22-10-20-16-15-13(21(2)3)8-19-9-14(15)24-17(16)18(22)23/h4-10H,1-3H3
n/an/a 4.04E+3n/an/an/an/an/an/a
Abbott Laboratories
Curated by ChEMBL
Assay Description
Antagonist activity at human mGluR5 expressed in 1321N1 cells assessed as effect on L-glutamate-induced calcium mobilization
J Med Chem 48: 7374-88 (2005)
Article DOI: 10.1021/jm0504407
BindingDB Entry DOI: 10.7270/Q27P8XX0
Metabotropic glutamate receptor 1
(Homo sapiens (Human))
BDBM50177062
(9-dimethylamino-3-(4-methylphenyl)-3H-5-thia-1,3,7...)
Show SMILES CN(C)c1cncc2sc3c(ncn(-c4ccc(C)cc4)c3=O)c12
Show InChI InChI=1S/C18H16N4OS/c1-11-4-6-12(7-5-11)22-10-20-16-15-13(21(2)3)8-19-9-14(15)24-17(16)18(22)23/h4-10H,1-3H3
n/an/a 43n/an/an/an/an/an/a
Abbott Laboratories
Curated by ChEMBL
Assay Description
Antagonist activity at human mGluR1 expressed in 1321N1 cells assessed as effect on L-glutamate-induced calcium mobilization
J Med Chem 48: 7374-88 (2005)
Article DOI: 10.1021/jm0504407
BindingDB Entry DOI: 10.7270/Q27P8XX0