BDBM50177535 CHEMBL379445::N-(4-(3-(4-((1H-imidazol-4-yl)methyl)piperidin-1-yl)propoxy)benzyl)-N-ethylethanamine
SMILES: CCN(CC)Cc1ccc(OCCCN2CCC(Cc3cnc[nH]3)CC2)cc1
InChI Key: InChIKey=DOPXQNGVZQOQIJ-UHFFFAOYSA-N
Data: 1 KI  1 IC50  1 Kd
Activity Spreadsheet -- Enzyme Inhibition Constant Data from BindingDB
Found 3 hits for monomerid = 50177535
Trg + Lig
Ki
nM
ΔG°
kcal/mole
IC50
nM
Kd
nM
EC50/IC50
nM
koff
s-1
kon
M-1s-1
pHTemp
°C
HRH3
(GUINEA PIG)
BDBM50177535
(CHEMBL379445 | N-(4-(3-(4-((1H-imidazol-4-yl)methy...)
Show SMILES CCN(CC)Cc1ccc(OCCCN2CCC(Cc3cnc[nH]3)CC2)cc1
Show InChI InChI=1S/C23H36N4O/c1-3-26(4-2)18-21-6-8-23(9-7-21)28-15-5-12-27-13-10-20(11-14-27)16-22-17-24-19-25-22/h6-9,17,19-20H,3-5,10-16,18H2,1-2H3,(H,24,25)
4n/an/an/an/an/an/an/an/a
The Schering Plough Research Institute
Curated by ChEMBL
Assay Description
Displacement of [3H]-N-alpha-methylhistamine from guinea pig histamine H3 receptor
Bioorg Med Chem Lett 16: 989-94 (2006)
Article DOI: 10.1016/j.bmcl.2005.10.087
BindingDB Entry DOI: 10.7270/Q2SJ1K5X
HRH3
(GUINEA PIG)
BDBM50177535
(CHEMBL379445 | N-(4-(3-(4-((1H-imidazol-4-yl)methy...)
Show SMILES CCN(CC)Cc1ccc(OCCCN2CCC(Cc3cnc[nH]3)CC2)cc1
Show InChI InChI=1S/C23H36N4O/c1-3-26(4-2)18-21-6-8-23(9-7-21)28-15-5-12-27-13-10-20(11-14-27)16-22-17-24-19-25-22/h6-9,17,19-20H,3-5,10-16,18H2,1-2H3,(H,24,25)
n/an/an/a 1.58n/an/an/an/an/a
The Schering Plough Research Institute
Curated by ChEMBL
Assay Description
Antagonistic activity against histamine H3 receptor in guinea pig ileum
Bioorg Med Chem Lett 16: 989-94 (2006)
Article DOI: 10.1016/j.bmcl.2005.10.087
BindingDB Entry DOI: 10.7270/Q2SJ1K5X
Cytochrome P450 2D6
(Homo sapiens (Human))
BDBM50177535
(CHEMBL379445 | N-(4-(3-(4-((1H-imidazol-4-yl)methy...)
Show SMILES CCN(CC)Cc1ccc(OCCCN2CCC(Cc3cnc[nH]3)CC2)cc1
Show InChI InChI=1S/C23H36N4O/c1-3-26(4-2)18-21-6-8-23(9-7-21)28-15-5-12-27-13-10-20(11-14-27)16-22-17-24-19-25-22/h6-9,17,19-20H,3-5,10-16,18H2,1-2H3,(H,24,25)
n/an/a 6.00E+3n/an/an/an/an/an/a
The Schering Plough Research Institute
Curated by ChEMBL
Assay Description
Inhibition of CYP2D6 by human liver microsome assay
Bioorg Med Chem Lett 16: 989-94 (2006)
Article DOI: 10.1016/j.bmcl.2005.10.087
BindingDB Entry DOI: 10.7270/Q2SJ1K5X