BDBM50177536 1-(4-(3-(4-((1H-imidazol-4-yl)methyl)piperidin-1-yl)propoxy)benzyl)piperidine::CHEMBL424675
SMILES: C(COc1ccc(CN2CCCCC2)cc1)CN1CCC(Cc2cnc[nH]2)CC1
InChI Key: InChIKey=AVPZIXKJIIIBCX-UHFFFAOYSA-N
Data: 1 KI  1 IC50  1 Kd
Activity Spreadsheet -- Enzyme Inhibition Constant Data from BindingDB
Found 3 hits for monomerid = 50177536
Trg + Lig
Ki
nM
ΔG°
kcal/mole
IC50
nM
Kd
nM
EC50/IC50
nM
koff
s-1
kon
M-1s-1
pHTemp
°C
HRH3
(GUINEA PIG)
BDBM50177536
(1-(4-(3-(4-((1H-imidazol-4-yl)methyl)piperidin-1-y...)
Show SMILES C(COc1ccc(CN2CCCCC2)cc1)CN1CCC(Cc2cnc[nH]2)CC1
Show InChI InChI=1S/C24H36N4O/c1-2-11-28(12-3-1)19-22-5-7-24(8-6-22)29-16-4-13-27-14-9-21(10-15-27)17-23-18-25-20-26-23/h5-8,18,20-21H,1-4,9-17,19H2,(H,25,26)
3n/an/an/an/an/an/an/an/a
The Schering Plough Research Institute
Curated by ChEMBL
Assay Description
Displacement of [3H]-N-alpha-methylhistamine from guinea pig histamine H3 receptor
Bioorg Med Chem Lett 16: 989-94 (2006)
Article DOI: 10.1016/j.bmcl.2005.10.087
BindingDB Entry DOI: 10.7270/Q2SJ1K5X
HRH3
(GUINEA PIG)
BDBM50177536
(1-(4-(3-(4-((1H-imidazol-4-yl)methyl)piperidin-1-y...)
Show SMILES C(COc1ccc(CN2CCCCC2)cc1)CN1CCC(Cc2cnc[nH]2)CC1
Show InChI InChI=1S/C24H36N4O/c1-2-11-28(12-3-1)19-22-5-7-24(8-6-22)29-16-4-13-27-14-9-21(10-15-27)17-23-18-25-20-26-23/h5-8,18,20-21H,1-4,9-17,19H2,(H,25,26)
n/an/an/a 2.51n/an/an/an/an/a
The Schering Plough Research Institute
Curated by ChEMBL
Assay Description
Antagonistic activity against histamine H3 receptor in guinea pig ileum
Bioorg Med Chem Lett 16: 989-94 (2006)
Article DOI: 10.1016/j.bmcl.2005.10.087
BindingDB Entry DOI: 10.7270/Q2SJ1K5X
Cytochrome P450 2D6
(Homo sapiens (Human))
BDBM50177536
(1-(4-(3-(4-((1H-imidazol-4-yl)methyl)piperidin-1-y...)
Show SMILES C(COc1ccc(CN2CCCCC2)cc1)CN1CCC(Cc2cnc[nH]2)CC1
Show InChI InChI=1S/C24H36N4O/c1-2-11-28(12-3-1)19-22-5-7-24(8-6-22)29-16-4-13-27-14-9-21(10-15-27)17-23-18-25-20-26-23/h5-8,18,20-21H,1-4,9-17,19H2,(H,25,26)
n/an/a 1.40E+4n/an/an/an/an/an/a
The Schering Plough Research Institute
Curated by ChEMBL
Assay Description
Inhibition of CYP2D6 by human liver microsome assay
Bioorg Med Chem Lett 16: 989-94 (2006)
Article DOI: 10.1016/j.bmcl.2005.10.087
BindingDB Entry DOI: 10.7270/Q2SJ1K5X