null
SMILES: OC(=O)CC(Cc1nc(CCCc2ccc3CCCNc3n2)no1)c1cccnc1
InChI Key: InChIKey=UMSKKXXFLOGWFX-UHFFFAOYSA-N
Activity Spreadsheet -- Enzyme Inhibition Constant Data from BindingDB
Found 5 hits for monomerid = 50177622
Trg + Lig
Ki
nM
ΔG°
kcal/mole
IC50
nM
Kd
nM
EC50/IC50
nM
koff
s-1
kon
M-1s-1
pHTemp
°C
Integrin alpha-V/beta-3
(Homo sapiens (Human))
BDBM50177622
(3-(pyridin-3-yl)-4-(3-(3-(5,6,7,8-tetrahydro-1,8-n...)
Show SMILES OC(=O)CC(Cc1nc(CCCc2ccc3CCCNc3n2)no1)c1cccnc1
Show InChI InChI=1S/C22H25N5O3/c28-21(29)13-17(16-5-2-10-23-14-16)12-20-26-19(27-30-20)7-1-6-18-9-8-15-4-3-11-24-22(15)25-18/h2,5,8-10,14,17H,1,3-4,6-7,11-13H2,(H,24,25)(H,28,29)
n/an/a 0.770n/an/an/an/an/an/a
Pfizer Inc.
Curated by ChEMBL
Assay Description
Inhibition of Integrin alphav-beta3 receptor expressed in HEK293 cells
Bioorg Med Chem Lett 16: 839-44 (2006)
Article DOI: 10.1016/j.bmcl.2005.11.008
BindingDB Entry DOI: 10.7270/Q28K78NF
Integrin alpha-IIb/beta-3
(Homo sapiens (Human))
BDBM50177622
(3-(pyridin-3-yl)-4-(3-(3-(5,6,7,8-tetrahydro-1,8-n...)
Show SMILES OC(=O)CC(Cc1nc(CCCc2ccc3CCCNc3n2)no1)c1cccnc1
Show InChI InChI=1S/C22H25N5O3/c28-21(29)13-17(16-5-2-10-23-14-16)12-20-26-19(27-30-20)7-1-6-18-9-8-15-4-3-11-24-22(15)25-18/h2,5,8-10,14,17H,1,3-4,6-7,11-13H2,(H,24,25)(H,28,29)
n/an/a 474n/an/an/an/an/an/a
Pfizer Inc.
Curated by ChEMBL
Assay Description
Inhibition of Integrin alpha2bbeta3 receptor by SPRA assay
Bioorg Med Chem Lett 16: 839-44 (2006)
Article DOI: 10.1016/j.bmcl.2005.11.008
BindingDB Entry DOI: 10.7270/Q28K78NF
Integrin alpha-V/beta-5
(Homo sapiens (Human))
BDBM50177622
(3-(pyridin-3-yl)-4-(3-(3-(5,6,7,8-tetrahydro-1,8-n...)
Show SMILES OC(=O)CC(Cc1nc(CCCc2ccc3CCCNc3n2)no1)c1cccnc1
Show InChI InChI=1S/C22H25N5O3/c28-21(29)13-17(16-5-2-10-23-14-16)12-20-26-19(27-30-20)7-1-6-18-9-8-15-4-3-11-24-22(15)25-18/h2,5,8-10,14,17H,1,3-4,6-7,11-13H2,(H,24,25)(H,28,29)
NCI pathway
Reactome pathway
n/an/a 3.30n/an/an/an/an/an/a
Pfizer Inc.
Curated by ChEMBL
Assay Description
Inhibition of Integrin alphav-beta5 receptor expressed in HEK293 cell line
Bioorg Med Chem Lett 16: 839-44 (2006)
Article DOI: 10.1016/j.bmcl.2005.11.008
BindingDB Entry DOI: 10.7270/Q28K78NF
Integrin alpha-V/beta-3
(Homo sapiens (Human))
BDBM50177622
(3-(pyridin-3-yl)-4-(3-(3-(5,6,7,8-tetrahydro-1,8-n...)
Show SMILES OC(=O)CC(Cc1nc(CCCc2ccc3CCCNc3n2)no1)c1cccnc1
Show InChI InChI=1S/C22H25N5O3/c28-21(29)13-17(16-5-2-10-23-14-16)12-20-26-19(27-30-20)7-1-6-18-9-8-15-4-3-11-24-22(15)25-18/h2,5,8-10,14,17H,1,3-4,6-7,11-13H2,(H,24,25)(H,28,29)
n/an/a 1.60n/an/an/an/an/an/a
Pfizer Inc.
Curated by ChEMBL
Assay Description
Inhibition of Integrin alphav-beta3 receptor by SPRA assay
Bioorg Med Chem Lett 16: 839-44 (2006)
Article DOI: 10.1016/j.bmcl.2005.11.008
BindingDB Entry DOI: 10.7270/Q28K78NF
Integrin alpha-V/beta-6
(Homo sapiens (Human))
BDBM50177622
(3-(pyridin-3-yl)-4-(3-(3-(5,6,7,8-tetrahydro-1,8-n...)
Show SMILES OC(=O)CC(Cc1nc(CCCc2ccc3CCCNc3n2)no1)c1cccnc1
Show InChI InChI=1S/C22H25N5O3/c28-21(29)13-17(16-5-2-10-23-14-16)12-20-26-19(27-30-20)7-1-6-18-9-8-15-4-3-11-24-22(15)25-18/h2,5,8-10,14,17H,1,3-4,6-7,11-13H2,(H,24,25)(H,28,29)
n/an/a 2.42E+3n/an/an/an/an/an/a
Pfizer Inc.
Curated by ChEMBL
Assay Description
Inhibition of Integrin alphav-beta6 receptor expressed in HT29 cell line
Bioorg Med Chem Lett 16: 839-44 (2006)
Article DOI: 10.1016/j.bmcl.2005.11.008
BindingDB Entry DOI: 10.7270/Q28K78NF