BDBM50177686 3-(1-methyl-4,5-trans-dimethyl-2-alpha-propylpiperidin-4-yl)phenol::CHEMBL202461
SMILES: CCC[C@@H]1C[C@](C)([C@@H](C)CN1C)c1cccc(O)c1
InChI Key: InChIKey=MNGYQAYMFXQRBL-YSVLISHTSA-N
Data: 3 KI  1 IC50
Activity Spreadsheet -- Enzyme Inhibition Constant Data from BindingDB
Found 4 hits for monomerid = 50177686
Trg + Lig
Ki
nM
ΔG°
kcal/mole
IC50
nM
Kd
nM
EC50/IC50
nM
koff
s-1
kon
M-1s-1
pHTemp
°C
Kappa-type opioid receptor
(Homo sapiens (Human))
BDBM50177686
(3-(1-methyl-4,5-trans-dimethyl-2-alpha-propylpiper...)
Show SMILES CCC[C@@H]1C[C@](C)([C@@H](C)CN1C)c1cccc(O)c1
Show InChI InChI=1S/C17H27NO/c1-5-7-15-11-17(3,13(2)12-18(15)4)14-8-6-9-16(19)10-14/h6,8-10,13,15,19H,5,7,11-12H2,1-4H3/t13-,15+,17+/m0/s1
Reactome pathway
220n/an/an/an/an/an/an/an/a
Adolor Corporation
Curated by ChEMBL
Assay Description
Displacement of [3H]diprenorphine from human cloned kappa opioid receptor
Bioorg Med Chem Lett 16: 864-8 (2006)
Article DOI: 10.1016/j.bmcl.2005.11.010
BindingDB Entry DOI: 10.7270/Q2RJ4J1J
Mu-type opioid receptor
(Homo sapiens (Human))
BDBM50177686
(3-(1-methyl-4,5-trans-dimethyl-2-alpha-propylpiper...)
Show SMILES CCC[C@@H]1C[C@](C)([C@@H](C)CN1C)c1cccc(O)c1
Show InChI InChI=1S/C17H27NO/c1-5-7-15-11-17(3,13(2)12-18(15)4)14-8-6-9-16(19)10-14/h6,8-10,13,15,19H,5,7,11-12H2,1-4H3/t13-,15+,17+/m0/s1
NCI pathway
Reactome pathway
520n/an/an/an/an/an/an/an/a
Adolor Corporation
Curated by ChEMBL
Assay Description
Inhibition of loperamide-stimulated [35S]GTP-gamma-S binding to membranes containing mu opioid receptor
Bioorg Med Chem Lett 16: 864-8 (2006)
Article DOI: 10.1016/j.bmcl.2005.11.010
BindingDB Entry DOI: 10.7270/Q2RJ4J1J
Delta-type opioid receptor
(Homo sapiens (Human))
BDBM50177686
(3-(1-methyl-4,5-trans-dimethyl-2-alpha-propylpiper...)
Show SMILES CCC[C@@H]1C[C@](C)([C@@H](C)CN1C)c1cccc(O)c1
Show InChI InChI=1S/C17H27NO/c1-5-7-15-11-17(3,13(2)12-18(15)4)14-8-6-9-16(19)10-14/h6,8-10,13,15,19H,5,7,11-12H2,1-4H3/t13-,15+,17+/m0/s1
Reactome pathway
>1.00E+3n/an/an/an/an/an/an/an/a
Adolor Corporation
Curated by ChEMBL
Assay Description
Displacement of [3H]diprenorphine from human cloned delta opioid receptor
Bioorg Med Chem Lett 16: 864-8 (2006)
Article DOI: 10.1016/j.bmcl.2005.11.010
BindingDB Entry DOI: 10.7270/Q2RJ4J1J
Mu-type opioid receptor
(Homo sapiens (Human))
BDBM50177686
(3-(1-methyl-4,5-trans-dimethyl-2-alpha-propylpiper...)
Show SMILES CCC[C@@H]1C[C@](C)([C@@H](C)CN1C)c1cccc(O)c1
Show InChI InChI=1S/C17H27NO/c1-5-7-15-11-17(3,13(2)12-18(15)4)14-8-6-9-16(19)10-14/h6,8-10,13,15,19H,5,7,11-12H2,1-4H3/t13-,15+,17+/m0/s1
NCI pathway
Reactome pathway
n/an/a 170n/an/an/an/an/an/a
Adolor Corporation
Curated by ChEMBL
Assay Description
Inhibition of loperamide-stimulated [35S]GTPgammaS binding to membranes containing mu opioid receptor
Bioorg Med Chem Lett 16: 864-8 (2006)
Article DOI: 10.1016/j.bmcl.2005.11.010
BindingDB Entry DOI: 10.7270/Q2RJ4J1J