BDBM50177692 3-(1-hexyl-trans-4,5-dimethyl-2-alpha-propylpiperidin-4-yl)phenol::CHEMBL202327
SMILES: CCCCCCN1C[C@H](C)[C@@](C)(C[C@H]1CCC)c1cccc(O)c1
InChI Key: InChIKey=CWLAOZOVCXCXKJ-CZTZKLFOSA-N
Data: 3 KI  1 IC50
Activity Spreadsheet -- Enzyme Inhibition Constant Data from BindingDB
Found 4 hits for monomerid = 50177692
Trg + Lig
Ki
nM
ΔG°
kcal/mole
IC50
nM
Kd
nM
EC50/IC50
nM
koff
s-1
kon
M-1s-1
pHTemp
°C
Mu-type opioid receptor
(Homo sapiens (Human))
BDBM50177692
(3-(1-hexyl-trans-4,5-dimethyl-2-alpha-propylpiperi...)
Show SMILES CCCCCCN1C[C@H](C)[C@@](C)(C[C@H]1CCC)c1cccc(O)c1
Show InChI InChI=1S/C22H37NO/c1-5-7-8-9-14-23-17-18(3)22(4,16-20(23)11-6-2)19-12-10-13-21(24)15-19/h10,12-13,15,18,20,24H,5-9,11,14,16-17H2,1-4H3/t18-,20+,22+/m0/s1
NCI pathway
Reactome pathway
47n/an/an/an/an/an/an/an/a
Adolor Corporation
Curated by ChEMBL
Assay Description
Displacement of [3H]diprenorphine from human cloned mu opioid receptor
Bioorg Med Chem Lett 16: 864-8 (2006)
Article DOI: 10.1016/j.bmcl.2005.11.010
BindingDB Entry DOI: 10.7270/Q2RJ4J1J
Kappa-type opioid receptor
(Homo sapiens (Human))
BDBM50177692
(3-(1-hexyl-trans-4,5-dimethyl-2-alpha-propylpiperi...)
Show SMILES CCCCCCN1C[C@H](C)[C@@](C)(C[C@H]1CCC)c1cccc(O)c1
Show InChI InChI=1S/C22H37NO/c1-5-7-8-9-14-23-17-18(3)22(4,16-20(23)11-6-2)19-12-10-13-21(24)15-19/h10,12-13,15,18,20,24H,5-9,11,14,16-17H2,1-4H3/t18-,20+,22+/m0/s1
Reactome pathway
150n/an/an/an/an/an/an/an/a
Adolor Corporation
Curated by ChEMBL
Assay Description
Displacement of [3H]diprenorphine from human cloned kappa opioid receptor
Bioorg Med Chem Lett 16: 864-8 (2006)
Article DOI: 10.1016/j.bmcl.2005.11.010
BindingDB Entry DOI: 10.7270/Q2RJ4J1J
Delta-type opioid receptor
(Homo sapiens (Human))
BDBM50177692
(3-(1-hexyl-trans-4,5-dimethyl-2-alpha-propylpiperi...)
Show SMILES CCCCCCN1C[C@H](C)[C@@](C)(C[C@H]1CCC)c1cccc(O)c1
Show InChI InChI=1S/C22H37NO/c1-5-7-8-9-14-23-17-18(3)22(4,16-20(23)11-6-2)19-12-10-13-21(24)15-19/h10,12-13,15,18,20,24H,5-9,11,14,16-17H2,1-4H3/t18-,20+,22+/m0/s1
Reactome pathway
340n/an/an/an/an/an/an/an/a
Adolor Corporation
Curated by ChEMBL
Assay Description
Displacement of [3H]diprenorphine from human cloned delta opioid receptor
Bioorg Med Chem Lett 16: 864-8 (2006)
Article DOI: 10.1016/j.bmcl.2005.11.010
BindingDB Entry DOI: 10.7270/Q2RJ4J1J
Mu-type opioid receptor
(Homo sapiens (Human))
BDBM50177692
(3-(1-hexyl-trans-4,5-dimethyl-2-alpha-propylpiperi...)
Show SMILES CCCCCCN1C[C@H](C)[C@@](C)(C[C@H]1CCC)c1cccc(O)c1
Show InChI InChI=1S/C22H37NO/c1-5-7-8-9-14-23-17-18(3)22(4,16-20(23)11-6-2)19-12-10-13-21(24)15-19/h10,12-13,15,18,20,24H,5-9,11,14,16-17H2,1-4H3/t18-,20+,22+/m0/s1
NCI pathway
Reactome pathway
n/an/a 39n/an/an/an/an/an/a
Adolor Corporation
Curated by ChEMBL
Assay Description
Inhibition of loperamide-stimulated [35S]GTPgammaS binding to membranes containing mu opioid receptor
Bioorg Med Chem Lett 16: 864-8 (2006)
Article DOI: 10.1016/j.bmcl.2005.11.010
BindingDB Entry DOI: 10.7270/Q2RJ4J1J