BDBM50177712 (2-methyl-5-oxo-5,11-dihydro-10-thia-dibenzo[a,d]cyclohepten-7-yl)-acetic acid::CHEMBL201985
SMILES: Cc1ccc2c(CSc3ccc(CC(O)=O)cc3C2=O)c1
InChI Key: InChIKey=SALAYBYCGYNWCE-UHFFFAOYSA-N
Data: 1 IC50
Activity Spreadsheet -- Enzyme Inhibition Constant Data from BindingDB
Found 1 hit for monomerid = 50177712
Trg + Lig
Ki
nM
ΔG°
kcal/mole
IC50
nM
Kd
nM
EC50/IC50
nM
koff
s-1
kon
M-1s-1
pHTemp
°C
Helicase IV
(Escherichia coli (strain K12))
BDBM50177712
((2-methyl-5-oxo-5,11-dihydro-10-thia-dibenzo[a,d]c...)
Show SMILES Cc1ccc2c(CSc3ccc(CC(O)=O)cc3C2=O)c1
Show InChI InChI=1S/C17H14O3S/c1-10-2-4-13-12(6-10)9-21-15-5-3-11(8-16(18)19)7-14(15)17(13)20/h2-7H,8-9H2,1H3,(H,18,19)
n/an/a 7.00E+3n/an/an/an/an/an/a
Novartis Institutes for Biomedical Research
Curated by ChEMBL
Assay Description
Inhibition of ATPase activity of Helicase4 from Escherichia coli in presence of ATP (5x Km(ATP)) and dT25 (5x KDNA)
Bioorg Med Chem Lett 16: 923-7 (2006)
Article DOI: 10.1016/j.bmcl.2005.10.110
BindingDB Entry DOI: 10.7270/Q2MS3SB8