BDBM50178168 CHEMBL3814246::US10206931, Example 176
SMILES: COc1ccc(cc1OC)-c1cccc2NC(=O)C[C@@H](C)Nc12
InChI Key: InChIKey=TUDUFFGDXQMAHC-LLVKDONJSA-N
Data: 3 IC50  1 EC50
Activity Spreadsheet -- Enzyme Inhibition Constant Data from BindingDB
Found 4 hits for monomerid = 50178168
Trg + Lig
Ki
nM
ΔG°
kcal/mole
IC50
nM
Kd
nM
EC50/IC50
nM
koff
s-1
kon
M-1s-1
pHTemp
°C
Bromodomain-containing protein 4
(Homo sapiens (Human))
BDBM50178168
(CHEMBL3814246 | US10206931, Example 176)
Show SMILES COc1ccc(cc1OC)-c1cccc2NC(=O)C[C@@H](C)Nc12 |r|
Show InChI InChI=1S/C18H20N2O3/c1-11-9-17(21)20-14-6-4-5-13(18(14)19-11)12-7-8-15(22-2)16(10-12)23-3/h4-8,10-11,19H,9H2,1-3H3,(H,20,21)/t11-/m1/s1
n/an/a 1.20E+4n/an/an/an/an/an/a
Constellation Pharmaceuticals
Curated by ChEMBL
Assay Description
Displacement of biotinylated ligand from recombinant His-tagged BRD4 bromodomain-1 (unknown origin) incubated for 10 mins by TR-FRET assay
ACS Med Chem Lett 7: 531-6 (2016)
BindingDB Entry DOI: 10.7270/Q20G3N3S
CREB-binding protein
(Homo sapiens (Human))
BDBM50178168
(CHEMBL3814246 | US10206931, Example 176)
Show SMILES COc1ccc(cc1OC)-c1cccc2NC(=O)C[C@@H](C)Nc12 |r|
Show InChI InChI=1S/C18H20N2O3/c1-11-9-17(21)20-14-6-4-5-13(18(14)19-11)12-7-8-15(22-2)16(10-12)23-3/h4-8,10-11,19H,9H2,1-3H3,(H,20,21)/t11-/m1/s1
Reactome pathway
US Patent
n/an/a 270n/an/an/an/an/an/a
GENENTECH, INC.; CONSTELLATION PHARMACEUTICALS, INC.
US Patent
Assay Description
His/Flag epitope tagged CBP was cloned, expressed, and purified to homogeneity. CBP binding and inhibition was assessed by monitoring the engagement ...
US Patent US10206931 (2019)
BindingDB Entry DOI: 10.7270/Q2GM89FR
CREB-binding protein
(Homo sapiens (Human))
BDBM50178168
(CHEMBL3814246 | US10206931, Example 176)
Show SMILES COc1ccc(cc1OC)-c1cccc2NC(=O)C[C@@H](C)Nc12 |r|
Show InChI InChI=1S/C18H20N2O3/c1-11-9-17(21)20-14-6-4-5-13(18(14)19-11)12-7-8-15(22-2)16(10-12)23-3/h4-8,10-11,19H,9H2,1-3H3,(H,20,21)/t11-/m1/s1
Reactome pathway
n/an/an/an/a 5.00E+3n/an/an/an/a
Constellation Pharmaceuticals
Curated by ChEMBL
Assay Description
Inhibition of Halo-tagged histone H3.3 binding to CBP (unknown origin) expressed in HEK293 cells after overnight incubation by luciferase reporter ge...
ACS Med Chem Lett 7: 531-6 (2016)
BindingDB Entry DOI: 10.7270/Q20G3N3S
CREB-binding protein
(Homo sapiens (Human))
BDBM50178168
(CHEMBL3814246 | US10206931, Example 176)
Show SMILES COc1ccc(cc1OC)-c1cccc2NC(=O)C[C@@H](C)Nc12 |r|
Show InChI InChI=1S/C18H20N2O3/c1-11-9-17(21)20-14-6-4-5-13(18(14)19-11)12-7-8-15(22-2)16(10-12)23-3/h4-8,10-11,19H,9H2,1-3H3,(H,20,21)/t11-/m1/s1
Reactome pathway
n/an/a 130n/an/an/an/an/an/a
Constellation Pharmaceuticals
Curated by ChEMBL
Assay Description
Displacement of biotinylated ligand from recombinant His-tagged CBP (unknown origin) incubated for 10 mins by TR-FRET assay
ACS Med Chem Lett 7: 531-6 (2016)
BindingDB Entry DOI: 10.7270/Q20G3N3S