BDBM50178203 CHEMBL3813958
SMILES: CC1(C)CC(=O)Nc2ccccc2N1
InChI Key: InChIKey=LHMWSVAJMJMOSV-UHFFFAOYSA-N
Data: 2 IC50
Activity Spreadsheet -- Enzyme Inhibition Constant Data from BindingDB
Found 2 hits for monomerid = 50178203
Trg + Lig
Ki
nM
ΔG°
kcal/mole
IC50
nM
Kd
nM
EC50/IC50
nM
koff
s-1
kon
M-1s-1
pHTemp
°C
CREB-binding protein
(Homo sapiens (Human))
BDBM50178203
(CHEMBL3813958)
Show SMILES CC1(C)CC(=O)Nc2ccccc2N1
Show InChI InChI=1S/C11H14N2O/c1-11(2)7-10(14)12-8-5-3-4-6-9(8)13-11/h3-6,13H,7H2,1-2H3,(H,12,14)
Reactome pathway
n/an/a>2.00E+5n/an/an/an/an/an/a
Constellation Pharmaceuticals
Curated by ChEMBL
Assay Description
Displacement of biotinylated ligand from recombinant His-tagged CBP (unknown origin) incubated for 10 mins by TR-FRET assay
ACS Med Chem Lett 7: 531-6 (2016)
BindingDB Entry DOI: 10.7270/Q20G3N3S
Bromodomain-containing protein 4
(Homo sapiens (Human))
BDBM50178203
(CHEMBL3813958)
Show SMILES CC1(C)CC(=O)Nc2ccccc2N1
Show InChI InChI=1S/C11H14N2O/c1-11(2)7-10(14)12-8-5-3-4-6-9(8)13-11/h3-6,13H,7H2,1-2H3,(H,12,14)
n/an/a>2.00E+5n/an/an/an/an/an/a
Constellation Pharmaceuticals
Curated by ChEMBL
Assay Description
Displacement of biotinylated ligand from recombinant His-tagged BRD4 bromodomain-1 (unknown origin) incubated for 10 mins by TR-FRET assay
ACS Med Chem Lett 7: 531-6 (2016)
BindingDB Entry DOI: 10.7270/Q20G3N3S