null
SMILES: O[C@H](CN[C@@](Cc1ccccc1)(c1cc(F)cc(c1)C(F)(F)F)c1ccc(Cl)cn1)C(F)(F)F
InChI Key: InChIKey=RAWCQYTUDGQHNY-RTWAWAEBSA-N
Activity Spreadsheet -- Enzyme Inhibition Constant Data from BindingDB
Found 2 hits for monomerid = 50178692
Trg + Lig
Ki
nM
ΔG°
kcal/mole
IC50
nM
Kd
nM
EC50/IC50
nM
koff
s-1
kon
M-1s-1
pHTemp
°C
Cholesteryl ester transfer protein
(Homo sapiens (Human))
BDBM50178692
(CHEMBL3814646)
Show SMILES O[C@H](CN[C@@](Cc1ccccc1)(c1cc(F)cc(c1)C(F)(F)F)c1ccc(Cl)cn1)C(F)(F)F |r|
Show InChI InChI=1S/C23H18ClF7N2O/c24-17-6-7-19(32-12-17)21(11-14-4-2-1-3-5-14,33-13-20(34)23(29,30)31)15-8-16(22(26,27)28)10-18(25)9-15/h1-10,12,20,33-34H,11,13H2/t20-,21+/m1/s1
Reactome pathway
n/an/a 1.60E+3n/an/an/an/an/an/a
Bristol-Myers Squibb Pharmaceutical Research Institute
Curated by ChEMBL
Assay Description
Inhibition of CETP in human whole plasma assessed as reduction in [3H]cholesteryl ester transfer from [3H]CE-HDL to LDL/VLDL
Bioorg Med Chem Lett 26: 3278-3281 (2016)
BindingDB Entry DOI: 10.7270/Q2TQ63FN
Cholesteryl ester transfer protein
(Homo sapiens (Human))
BDBM50178692
(CHEMBL3814646)
Show SMILES O[C@H](CN[C@@](Cc1ccccc1)(c1cc(F)cc(c1)C(F)(F)F)c1ccc(Cl)cn1)C(F)(F)F |r|
Show InChI InChI=1S/C23H18ClF7N2O/c24-17-6-7-19(32-12-17)21(11-14-4-2-1-3-5-14,33-13-20(34)23(29,30)31)15-8-16(22(26,27)28)10-18(25)9-15/h1-10,12,20,33-34H,11,13H2/t20-,21+/m1/s1
Reactome pathway
n/an/a 22n/an/an/an/an/an/a
Bristol-Myers Squibb Pharmaceutical Research Institute
Curated by ChEMBL
Assay Description
Inhibition of human recombinant CETP assessed as reduction in [3H]cholesteryl ester transfer from [3H]CE-HDL to biotinylated LDL by scintillation pro...
Bioorg Med Chem Lett 26: 3278-3281 (2016)
BindingDB Entry DOI: 10.7270/Q2TQ63FN