BDBM50178762 1,6-bis-(Dmt-Tic-amino)hexane::CHEMBL197185
SMILES: Cc1cc(O)cc(C)c1C[C@H](N)C(=O)N1Cc2ccccc2CC1C(=O)NCCCCCCNC(=O)C1Cc2ccccc2CN1C(=O)[C@@H](N)Cc1c(C)cc(O)cc1C
InChI Key: InChIKey=VJIXEMXKNBJTQB-GCGBLBKRSA-N
Data: 2 KI  2 IC50
Activity Spreadsheet -- Enzyme Inhibition Constant Data from BindingDB
Found 4 hits for monomerid = 50178762
Trg + Lig
Ki
nM
ΔG°
kcal/mole
IC50
nM
Kd
nM
EC50/IC50
nM
koff
s-1
kon
M-1s-1
pHTemp
°C
Opioid receptors; mu & delta
(Rattus norvegicus (rat))
BDBM50178762
(1,6-bis-(Dmt-Tic-amino)hexane | CHEMBL197185)
Show SMILES Cc1cc(O)cc(C)c1C[C@H](N)C(=O)N1Cc2ccccc2CC1C(=O)NCCCCCCNC(=O)C1Cc2ccccc2CN1C(=O)[C@@H](N)Cc1c(C)cc(O)cc1C
Show InChI InChI=1S/C48H60N6O6/c1-29-19-37(55)20-30(2)39(29)25-41(49)47(59)53-27-35-15-9-7-13-33(35)23-43(53)45(57)51-17-11-5-6-12-18-52-46(58)44-24-34-14-8-10-16-36(34)28-54(44)48(60)42(50)26-40-31(3)21-38(56)22-32(40)4/h7-10,13-16,19-22,41-44,55-56H,5-6,11-12,17-18,23-28,49-50H2,1-4H3,(H,51,57)(H,52,58)/t41-,42-,43?,44?/m0/s1
Reactome pathway
0.129n/an/an/an/an/an/an/an/a
Kobe Gakuin University
Curated by ChEMBL
Assay Description
Displacement of [3H]deltorphin-II from delta opioid receptor in rat brain synaptosomal membranes
J Med Chem 48: 8035-44 (2005)
Article DOI: 10.1021/jm050377l
BindingDB Entry DOI: 10.7270/Q2C53KD9
Mu-type opioid receptor
(Rattus norvegicus (rat))
BDBM50178762
(1,6-bis-(Dmt-Tic-amino)hexane | CHEMBL197185)
Show SMILES Cc1cc(O)cc(C)c1C[C@H](N)C(=O)N1Cc2ccccc2CC1C(=O)NCCCCCCNC(=O)C1Cc2ccccc2CN1C(=O)[C@@H](N)Cc1c(C)cc(O)cc1C
Show InChI InChI=1S/C48H60N6O6/c1-29-19-37(55)20-30(2)39(29)25-41(49)47(59)53-27-35-15-9-7-13-33(35)23-43(53)45(57)51-17-11-5-6-12-18-52-46(58)44-24-34-14-8-10-16-36(34)28-54(44)48(60)42(50)26-40-31(3)21-38(56)22-32(40)4/h7-10,13-16,19-22,41-44,55-56H,5-6,11-12,17-18,23-28,49-50H2,1-4H3,(H,51,57)(H,52,58)/t41-,42-,43?,44?/m0/s1
Reactome pathway
1.79n/an/an/an/an/an/an/an/a
Kobe Gakuin University
Curated by ChEMBL
Assay Description
Displacement of [3H]DAMGO from mu opioid receptor expressed in rat brain synaptosomal membranes
J Med Chem 48: 8035-44 (2005)
Article DOI: 10.1021/jm050377l
BindingDB Entry DOI: 10.7270/Q2C53KD9
Mu-type opioid receptor
(GUINEA PIG)
BDBM50178762
(1,6-bis-(Dmt-Tic-amino)hexane | CHEMBL197185)
Show SMILES Cc1cc(O)cc(C)c1C[C@H](N)C(=O)N1Cc2ccccc2CC1C(=O)NCCCCCCNC(=O)C1Cc2ccccc2CN1C(=O)[C@@H](N)Cc1c(C)cc(O)cc1C
Show InChI InChI=1S/C48H60N6O6/c1-29-19-37(55)20-30(2)39(29)25-41(49)47(59)53-27-35-15-9-7-13-33(35)23-43(53)45(57)51-17-11-5-6-12-18-52-46(58)44-24-34-14-8-10-16-36(34)28-54(44)48(60)42(50)26-40-31(3)21-38(56)22-32(40)4/h7-10,13-16,19-22,41-44,55-56H,5-6,11-12,17-18,23-28,49-50H2,1-4H3,(H,51,57)(H,52,58)/t41-,42-,43?,44?/m0/s1
n/an/a 2.72E+3n/an/an/an/an/an/a
Kobe Gakuin University
Curated by ChEMBL
Assay Description
Agonistic activity at mu opioid receptor in myenteric plexus longitudinal muscle of guinea pig ileum
J Med Chem 48: 8035-44 (2005)
Article DOI: 10.1021/jm050377l
BindingDB Entry DOI: 10.7270/Q2C53KD9
Delta-type opioid receptor
(MOUSE)
BDBM50178762
(1,6-bis-(Dmt-Tic-amino)hexane | CHEMBL197185)
Show SMILES Cc1cc(O)cc(C)c1C[C@H](N)C(=O)N1Cc2ccccc2CC1C(=O)NCCCCCCNC(=O)C1Cc2ccccc2CN1C(=O)[C@@H](N)Cc1c(C)cc(O)cc1C
Show InChI InChI=1S/C48H60N6O6/c1-29-19-37(55)20-30(2)39(29)25-41(49)47(59)53-27-35-15-9-7-13-33(35)23-43(53)45(57)51-17-11-5-6-12-18-52-46(58)44-24-34-14-8-10-16-36(34)28-54(44)48(60)42(50)26-40-31(3)21-38(56)22-32(40)4/h7-10,13-16,19-22,41-44,55-56H,5-6,11-12,17-18,23-28,49-50H2,1-4H3,(H,51,57)(H,52,58)/t41-,42-,43?,44?/m0/s1
Reactome pathway
n/an/a>1.00E+4n/an/an/an/an/an/a
Kobe Gakuin University
Curated by ChEMBL
Assay Description
Agonistic activity at delta opioid receptor in mouse vas deferens
J Med Chem 48: 8035-44 (2005)
Article DOI: 10.1021/jm050377l
BindingDB Entry DOI: 10.7270/Q2C53KD9