null
SMILES: Fc1cc2c(cc1-c1cccnc1)n(C1CC1)c1s[nH]c(=O)c1c2=O
InChI Key: InChIKey=XFFNZYGEEVRMSC-UHFFFAOYSA-N
Activity Spreadsheet -- Enzyme Inhibition Constant Data from BindingDB
Found 1 hit for monomerid = 50178912
Trg + Lig
Ki
nM
ΔG°
kcal/mole
IC50
nM
Kd
nM
EC50/IC50
nM
koff
s-1
kon
M-1s-1
pHTemp
°C
DNA topoisomerase 4 subunit A
(Staphylococcus aureus)
BDBM50178912
(9-cyclopropyl-6-fluoro-7-(pyridin-3-yl)isothiazolo...)
Show SMILES Fc1cc2c(cc1-c1cccnc1)n(C1CC1)c1s[nH]c(=O)c1c2=O
Show InChI InChI=1S/C18H12FN3O2S/c19-13-6-12-14(7-11(13)9-2-1-5-20-8-9)22(10-3-4-10)18-15(16(12)23)17(24)21-25-18/h1-2,5-8,10H,3-4H2,(H,21,24)
n/an/a 500n/an/an/an/an/an/a
Achillion Pharmaceuticals, Inc.
Curated by ChEMBL
Assay Description
Inhibitory activity against Staphylococcus aureus ATCC 29213 wild type Topo 4
Bioorg Med Chem Lett 16: 1277-81 (2006)
Article DOI: 10.1016/j.bmcl.2005.11.064
BindingDB Entry DOI: 10.7270/Q26D5SKN