BDBM50178997 CHEMBL380861::N2,N4-bis(4-fluorophenyl)-N6-(2-morpholinoethyl)-1,3,5-triazine-2,4,6-triamine
SMILES: Fc1ccc(Nc2nc(NCCN3CCOCC3)nc(Nc3ccc(F)cc3)n2)cc1
InChI Key: InChIKey=XARHVILHYGKXGM-UHFFFAOYSA-N
Data: 1 IC50
Activity Spreadsheet -- Enzyme Inhibition Constant Data from BindingDB
Found 1 hit for monomerid = 50178997
Trg + Lig
Ki
nM
ΔG°
kcal/mole
IC50
nM
Kd
nM
EC50/IC50
nM
koff
s-1
kon
M-1s-1
pHTemp
°C
Replicative DNA helicase
(Pseudomonas aeruginosa)
BDBM50178997
(CHEMBL380861 | N2,N4-bis(4-fluorophenyl)-N6-(2-mor...)
Show SMILES Fc1ccc(Nc2nc(NCCN3CCOCC3)nc(Nc3ccc(F)cc3)n2)cc1
Show InChI InChI=1S/C21H23F2N7O/c22-15-1-5-17(6-2-15)25-20-27-19(24-9-10-30-11-13-31-14-12-30)28-21(29-20)26-18-7-3-16(23)4-8-18/h1-8H,9-14H2,(H3,24,25,26,27,28,29)
n/an/a>1.00E+5n/an/an/an/an/an/a
Targanta Therapeutics Inc.
Curated by ChEMBL
Assay Description
Inhibition of Pseudomonas aeruginosa DnaB helicase
Bioorg Med Chem Lett 16: 1286-90 (2006)
Article DOI: 10.1016/j.bmcl.2005.11.076
BindingDB Entry DOI: 10.7270/Q2PG1R95