BDBM50179235 2-{5-[4-(7-propyl-3-trifluoromethylbenzo[d]isoxazol-6-yloxy)butoxy]-1H-indol-1-yl}ethanoic acid::CHEMBL177831
SMILES: CCCc1c(OCCCCOc2ccc3n(CC(O)=O)ccc3c2)ccc2c(noc12)C(F)(F)F
InChI Key: InChIKey=CTQAHDQWGGICBF-UHFFFAOYSA-N
Data: 1 IC50  3 EC50
Activity Spreadsheet -- Enzyme Inhibition Constant Data from BindingDB
Found 4 hits for monomerid = 50179235
Trg + Lig
Ki
nM
ΔG°
kcal/mole
IC50
nM
Kd
nM
EC50/IC50
nM
koff
s-1
kon
M-1s-1
pHTemp
°C
Peroxisome proliferator-activated receptor
(Homo sapiens (Human))
BDBM50179235
(2-{5-[4-(7-propyl-3-trifluoromethylbenzo[d]isoxazo...)
Show SMILES CCCc1c(OCCCCOc2ccc3n(CC(O)=O)ccc3c2)ccc2c(noc12)C(F)(F)F
Show InChI InChI=1S/C25H25F3N2O5/c1-2-5-18-21(9-7-19-23(18)35-29-24(19)25(26,27)28)34-13-4-3-12-33-17-6-8-20-16(14-17)10-11-30(20)15-22(31)32/h6-11,14H,2-5,12-13,15H2,1H3,(H,31,32)
NCI pathway
Reactome pathway
n/an/a 105n/an/an/an/an/an/a
National Health Research Institutes
Curated by ChEMBL
Assay Description
Displacement of [3H]-rosiglitazone from human PPAR gamma by SPA assay
J Med Chem 48: 8194-208 (2005)
Article DOI: 10.1021/jm0506930
BindingDB Entry DOI: 10.7270/Q2R78DS5
Peroxisome proliferator-activated receptor
(Homo sapiens (Human))
BDBM50179235
(2-{5-[4-(7-propyl-3-trifluoromethylbenzo[d]isoxazo...)
Show SMILES CCCc1c(OCCCCOc2ccc3n(CC(O)=O)ccc3c2)ccc2c(noc12)C(F)(F)F
Show InChI InChI=1S/C25H25F3N2O5/c1-2-5-18-21(9-7-19-23(18)35-29-24(19)25(26,27)28)34-13-4-3-12-33-17-6-8-20-16(14-17)10-11-30(20)15-22(31)32/h6-11,14H,2-5,12-13,15H2,1H3,(H,31,32)
NCI pathway
Reactome pathway
n/an/an/an/a 280n/an/an/an/a
National Health Research Institutes
Curated by ChEMBL
Assay Description
Functional activity at human PPAR gamma in Huh7 cells by transactivation assay
J Med Chem 48: 8194-208 (2005)
Article DOI: 10.1021/jm0506930
BindingDB Entry DOI: 10.7270/Q2R78DS5
Peroxisome proliferator-activated receptor alpha (PPAR alpha)
(Homo sapiens (Human))
BDBM50179235
(2-{5-[4-(7-propyl-3-trifluoromethylbenzo[d]isoxazo...)
Show SMILES CCCc1c(OCCCCOc2ccc3n(CC(O)=O)ccc3c2)ccc2c(noc12)C(F)(F)F
Show InChI InChI=1S/C25H25F3N2O5/c1-2-5-18-21(9-7-19-23(18)35-29-24(19)25(26,27)28)34-13-4-3-12-33-17-6-8-20-16(14-17)10-11-30(20)15-22(31)32/h6-11,14H,2-5,12-13,15H2,1H3,(H,31,32)
n/an/an/an/a 1.04E+3n/an/an/an/a
National Health Research Institutes
Curated by ChEMBL
Assay Description
Functional activity at human PPAR alpha in Huh7 cells by transactivation assay
J Med Chem 48: 8194-208 (2005)
Article DOI: 10.1021/jm0506930
BindingDB Entry DOI: 10.7270/Q2R78DS5
Peroxisome proliferator-activated receptor delta
(Homo sapiens (Human))
BDBM50179235
(2-{5-[4-(7-propyl-3-trifluoromethylbenzo[d]isoxazo...)
Show SMILES CCCc1c(OCCCCOc2ccc3n(CC(O)=O)ccc3c2)ccc2c(noc12)C(F)(F)F
Show InChI InChI=1S/C25H25F3N2O5/c1-2-5-18-21(9-7-19-23(18)35-29-24(19)25(26,27)28)34-13-4-3-12-33-17-6-8-20-16(14-17)10-11-30(20)15-22(31)32/h6-11,14H,2-5,12-13,15H2,1H3,(H,31,32)
n/an/an/an/a 243n/an/an/an/a
National Health Research Institutes
Curated by ChEMBL
Assay Description
Functional activity at human PPAR delta in Huh7 cells by transactivation assay
J Med Chem 48: 8194-208 (2005)
Article DOI: 10.1021/jm0506930
BindingDB Entry DOI: 10.7270/Q2R78DS5