BDBM50179466 (2R,5R)-5-acetylamino-2-(4-fluoro-benzyl)-6-(4-hydroxy-phenyl)-hexanoic acid [(S)-4-guanidino-1-((S)-1-methylcarbamoyl-2-naphthalen-2-yl-ethylcarbamoyl)-butyl]-amide::CHEMBL437132
SMILES: [#6]-[#7]-[#6](=O)-[#6@H](-[#6]-c1ccc2ccccc2c1)-[#7]-[#6](=O)-[#6@H](-[#6]-[#6]-[#6]\[#7]=[#6](\[#7])-[#7])-[#7]-[#6](=O)-[#6@H](-[#6]-[#6]-[#6@H](-[#6]-c1ccc(-[#8])cc1)-[#7]-[#6](-[#6])=O)-[#6]-c1ccc(F)cc1
InChI Key: InChIKey=HPFQGCSUEXCNCU-KUHXYZIISA-N
Data: 3 KI  1 EC50
Activity Spreadsheet -- Enzyme Inhibition Constant Data from BindingDB
Found 4 hits for monomerid = 50179466
Trg + Lig
Ki
nM
ΔG°
kcal/mole
IC50
nM
Kd
nM
EC50/IC50
nM
koff
s-1
kon
M-1s-1
pHTemp
°C
Melanocortin receptor 4
(Homo sapiens (Human))
BDBM50179466
((2R,5R)-5-acetylamino-2-(4-fluoro-benzyl)-6-(4-hyd...)
Show SMILES [#6]-[#7]-[#6](=O)-[#6@H](-[#6]-c1ccc2ccccc2c1)-[#7]-[#6](=O)-[#6@H](-[#6]-[#6]-[#6]\[#7]=[#6](\[#7])-[#7])-[#7]-[#6](=O)-[#6@H](-[#6]-[#6]-[#6@H](-[#6]-c1ccc(-[#8])cc1)-[#7]-[#6](-[#6])=O)-[#6]-c1ccc(F)cc1
Show InChI InChI=1S/C41H50FN7O5/c1-26(50)47-34(24-28-12-19-35(51)20-13-28)18-15-32(22-27-10-16-33(42)17-11-27)38(52)48-36(8-5-21-46-41(43)44)40(54)49-37(39(53)45-2)25-29-9-14-30-6-3-4-7-31(30)23-29/h3-4,6-7,9-14,16-17,19-20,23,32,34,36-37,51H,5,8,15,18,21-22,24-25H2,1-2H3,(H,45,53)(H,47,50)(H,48,52)(H,49,54)(H4,43,44,46)/t32-,34-,36+,37+/m1/s1
5n/an/an/an/an/an/an/an/a
Procter & Gamble Pharmaceuticals
Curated by ChEMBL
Assay Description
Binding affinity to MC4 receptor
Bioorg Med Chem Lett 16: 1721-5 (2006)
Article DOI: 10.1016/j.bmcl.2005.12.005
BindingDB Entry DOI: 10.7270/Q2ZS2W2N
Melanocortin receptor 3
(Homo sapiens (Human))
BDBM50179466
((2R,5R)-5-acetylamino-2-(4-fluoro-benzyl)-6-(4-hyd...)
Show SMILES [#6]-[#7]-[#6](=O)-[#6@H](-[#6]-c1ccc2ccccc2c1)-[#7]-[#6](=O)-[#6@H](-[#6]-[#6]-[#6]\[#7]=[#6](\[#7])-[#7])-[#7]-[#6](=O)-[#6@H](-[#6]-[#6]-[#6@H](-[#6]-c1ccc(-[#8])cc1)-[#7]-[#6](-[#6])=O)-[#6]-c1ccc(F)cc1
Show InChI InChI=1S/C41H50FN7O5/c1-26(50)47-34(24-28-12-19-35(51)20-13-28)18-15-32(22-27-10-16-33(42)17-11-27)38(52)48-36(8-5-21-46-41(43)44)40(54)49-37(39(53)45-2)25-29-9-14-30-6-3-4-7-31(30)23-29/h3-4,6-7,9-14,16-17,19-20,23,32,34,36-37,51H,5,8,15,18,21-22,24-25H2,1-2H3,(H,45,53)(H,47,50)(H,48,52)(H,49,54)(H4,43,44,46)/t32-,34-,36+,37+/m1/s1
6.20E+3n/an/an/an/an/an/an/an/a
Procter & Gamble Pharmaceuticals
Curated by ChEMBL
Assay Description
Binding affinity to MC3 receptor
Bioorg Med Chem Lett 16: 1721-5 (2006)
Article DOI: 10.1016/j.bmcl.2005.12.005
BindingDB Entry DOI: 10.7270/Q2ZS2W2N
Melanocyte-stimulating hormone receptor
(Homo sapiens (Human))
BDBM50179466
((2R,5R)-5-acetylamino-2-(4-fluoro-benzyl)-6-(4-hyd...)
Show SMILES [#6]-[#7]-[#6](=O)-[#6@H](-[#6]-c1ccc2ccccc2c1)-[#7]-[#6](=O)-[#6@H](-[#6]-[#6]-[#6]\[#7]=[#6](\[#7])-[#7])-[#7]-[#6](=O)-[#6@H](-[#6]-[#6]-[#6@H](-[#6]-c1ccc(-[#8])cc1)-[#7]-[#6](-[#6])=O)-[#6]-c1ccc(F)cc1
Show InChI InChI=1S/C41H50FN7O5/c1-26(50)47-34(24-28-12-19-35(51)20-13-28)18-15-32(22-27-10-16-33(42)17-11-27)38(52)48-36(8-5-21-46-41(43)44)40(54)49-37(39(53)45-2)25-29-9-14-30-6-3-4-7-31(30)23-29/h3-4,6-7,9-14,16-17,19-20,23,32,34,36-37,51H,5,8,15,18,21-22,24-25H2,1-2H3,(H,45,53)(H,47,50)(H,48,52)(H,49,54)(H4,43,44,46)/t32-,34-,36+,37+/m1/s1
2.23E+4n/an/an/an/an/an/an/an/a
Procter & Gamble Pharmaceuticals
Curated by ChEMBL
Assay Description
Binding affinity to MC1 receptor
Bioorg Med Chem Lett 16: 1721-5 (2006)
Article DOI: 10.1016/j.bmcl.2005.12.005
BindingDB Entry DOI: 10.7270/Q2ZS2W2N
Melanocortin receptor 4
(Homo sapiens (Human))
BDBM50179466
((2R,5R)-5-acetylamino-2-(4-fluoro-benzyl)-6-(4-hyd...)
Show SMILES [#6]-[#7]-[#6](=O)-[#6@H](-[#6]-c1ccc2ccccc2c1)-[#7]-[#6](=O)-[#6@H](-[#6]-[#6]-[#6]\[#7]=[#6](\[#7])-[#7])-[#7]-[#6](=O)-[#6@H](-[#6]-[#6]-[#6@H](-[#6]-c1ccc(-[#8])cc1)-[#7]-[#6](-[#6])=O)-[#6]-c1ccc(F)cc1
Show InChI InChI=1S/C41H50FN7O5/c1-26(50)47-34(24-28-12-19-35(51)20-13-28)18-15-32(22-27-10-16-33(42)17-11-27)38(52)48-36(8-5-21-46-41(43)44)40(54)49-37(39(53)45-2)25-29-9-14-30-6-3-4-7-31(30)23-29/h3-4,6-7,9-14,16-17,19-20,23,32,34,36-37,51H,5,8,15,18,21-22,24-25H2,1-2H3,(H,45,53)(H,47,50)(H,48,52)(H,49,54)(H4,43,44,46)/t32-,34-,36+,37+/m1/s1
n/an/an/an/a 10n/an/an/an/a
Procter & Gamble Pharmaceuticals
Curated by ChEMBL
Assay Description
Agonist potency at MC4 receptor
Bioorg Med Chem Lett 16: 1721-5 (2006)
Article DOI: 10.1016/j.bmcl.2005.12.005
BindingDB Entry DOI: 10.7270/Q2ZS2W2N