BDBM50179602 1-(5-(methylsulfonyl)pyridin-2-yl)-5-(5,6,7,8-tetrahydronaphthalen-1-yloxy)-3-(trifluoromethyl)-1H-pyrazole-4-carbonitrile::CHEMBL426117
SMILES: CS(=O)(=O)c1ccc(nc1)-n1nc(c(C#N)c1Oc1cccc2CCCCc12)C(F)(F)F
InChI Key: InChIKey=UFEUEPCSGPEAFF-UHFFFAOYSA-N
Data: 2 IC50
Activity Spreadsheet -- Enzyme Inhibition Constant Data from BindingDB
Found 2 hits for monomerid = 50179602
Trg + Lig
Ki
nM
ΔG°
kcal/mole
IC50
nM
Kd
nM
EC50/IC50
nM
koff
s-1
kon
M-1s-1
pHTemp
°C
Prostaglandin G/H synthase 1
(Canis familiaris)
BDBM50179602
(1-(5-(methylsulfonyl)pyridin-2-yl)-5-(5,6,7,8-tetr...)
Show SMILES CS(=O)(=O)c1ccc(nc1)-n1nc(c(C#N)c1Oc1cccc2CCCCc12)C(F)(F)F
Show InChI InChI=1S/C21H17F3N4O3S/c1-32(29,30)14-9-10-18(26-12-14)28-20(16(11-25)19(27-28)21(22,23)24)31-17-8-4-6-13-5-2-3-7-15(13)17/h4,6,8-10,12H,2-3,5,7H2,1H3
Reactome pathway
n/an/a 100n/an/an/an/an/an/a
Pfizer Inc.
Curated by ChEMBL
Assay Description
Inhibition of COX1 by canine whole blood assay
Bioorg Med Chem Lett 16: 1202-6 (2006)
Article DOI: 10.1016/j.bmcl.2005.11.110
BindingDB Entry DOI: 10.7270/Q2FT8KKM
Prostaglandin G/H synthase 2
(Canis familiaris)
BDBM50179602
(1-(5-(methylsulfonyl)pyridin-2-yl)-5-(5,6,7,8-tetr...)
Show SMILES CS(=O)(=O)c1ccc(nc1)-n1nc(c(C#N)c1Oc1cccc2CCCCc12)C(F)(F)F
Show InChI InChI=1S/C21H17F3N4O3S/c1-32(29,30)14-9-10-18(26-12-14)28-20(16(11-25)19(27-28)21(22,23)24)31-17-8-4-6-13-5-2-3-7-15(13)17/h4,6,8-10,12H,2-3,5,7H2,1H3
Reactome pathway
n/an/a 900n/an/an/an/an/an/a
Pfizer Inc.
Curated by ChEMBL
Assay Description
Inhibition of COX2 by canine whole blood assay
Bioorg Med Chem Lett 16: 1202-6 (2006)
Article DOI: 10.1016/j.bmcl.2005.11.110
BindingDB Entry DOI: 10.7270/Q2FT8KKM