BDBM50179990 CHEMBL78779
SMILES: CN(C)C(=O)Oc1ccc2c(C)c(Cc3ccc(F)cc3)c(=O)oc2c1
InChI Key: InChIKey=ZJZMAUBKRKIVPH-UHFFFAOYSA-N
Data: 1 IC50
Activity Spreadsheet -- Enzyme Inhibition Constant Data from BindingDB
Found 1 hit for monomerid = 50179990
Trg + Lig
Ki
nM
ΔG°
kcal/mole
IC50
nM
Kd
nM
EC50/IC50
nM
koff
s-1
kon
M-1s-1
pHTemp
°C
Serine/threonine-protein kinase B-raf
(Homo sapiens (Human))
BDBM50179990
(CHEMBL78779)
Show SMILES CN(C)C(=O)Oc1ccc2c(C)c(Cc3ccc(F)cc3)c(=O)oc2c1
Show InChI InChI=1S/C20H18FNO4/c1-12-16-9-8-15(25-20(24)22(2)3)11-18(16)26-19(23)17(12)10-13-4-6-14(21)7-5-13/h4-9,11H,10H2,1-3H3
NCI pathway
Reactome pathway
n/an/a 320n/an/an/an/an/an/a
Peking University Health Science Center
Curated by ChEMBL
Assay Description
Inhibition of N-terminal GST-tagged human BRAF/MEK1/RAF1 Y340D/Y341D double mutant measured after 2 hrs in presence of ATP by TR-FRET assay
Bioorg Med Chem 24: 3472-82 (2016)
BindingDB Entry DOI: 10.7270/Q251415P