BDBM50180046 3-[2-isobutoxy-5-(4-propoxybenzoyl)phenyl]propionic acid::CHEMBL201079
SMILES: CCCOc1ccc(cc1)C(=O)c1ccc(OCC(C)C)c(CCC(O)=O)c1
InChI Key: InChIKey=JRVGSKYRNMMJGV-UHFFFAOYSA-N
Data: 1 IC50
Activity Spreadsheet -- Enzyme Inhibition Constant Data from BindingDB
Found 1 hit for monomerid = 50180046
Trg + Lig
Ki
nM
ΔG°
kcal/mole
IC50
nM
Kd
nM
EC50/IC50
nM
koff
s-1
kon
M-1s-1
pHTemp
°C
Proto-oncogene c-JUN/protein c-fos
(Homo sapiens (Human))
BDBM50180046
(3-[2-isobutoxy-5-(4-propoxybenzoyl)phenyl]propioni...)
Show SMILES CCCOc1ccc(cc1)C(=O)c1ccc(OCC(C)C)c(CCC(O)=O)c1
Show InChI InChI=1S/C23H28O5/c1-4-13-27-20-9-5-17(6-10-20)23(26)19-7-11-21(28-15-16(2)3)18(14-19)8-12-22(24)25/h5-7,9-11,14,16H,4,8,12-13,15H2,1-3H3,(H,24,25)
n/an/a 9.30E+5n/an/an/an/an/an/a
Toyama Chemical Co., Ltd.
Curated by ChEMBL
Assay Description
Inhibitory activity on AP1 using ELISA based AP1 DNA binding
J Med Chem 49: 80-91 (2006)
Article DOI: 10.1021/jm050550d
BindingDB Entry DOI: 10.7270/Q2VX0G2C