BDBM50180149 3-BIPHENYL-3-YL-1-(2-HYDROXY-2,2-DIPHOSPHONOETHYL)PYRIDINIUM::3-biphenyl-3-yl-1-(2-hydroxy-2,2-bis-phosphono-ethyl)-pyridinium::CHEMBL200335
SMILES: OC(C[n+]1cccc(c1)-c1cccc(c1)-c1ccccc1)(P(O)(O)=O)P(O)(O)=O
InChI Key: InChIKey=SFGYQDTXSJEVCC-UHFFFAOYSA-O
Data: 1 IC50
PDB links: 1 PDB ID matches this monomer.
Activity Spreadsheet -- Enzyme Inhibition Constant Data from BindingDB
Found 1 hit for monomerid = 50180149
Trg + Lig
Ki
nM
ΔG°
kcal/mole
IC50
nM
Kd
nM
EC50/IC50
nM
koff
s-1
kon
M-1s-1
pHTemp
°C
Phosphotransferase
(Trypanosoma cruzi)
BDBM50180149
(3-BIPHENYL-3-YL-1-(2-HYDROXY-2,2-DIPHOSPHONOETHYL)...)
Show SMILES OC(C[n+]1cccc(c1)-c1cccc(c1)-c1ccccc1)(P(O)(O)=O)P(O)(O)=O
Show InChI InChI=1S/C19H19NO7P2/c21-19(28(22,23)24,29(25,26)27)14-20-11-5-10-18(13-20)17-9-4-8-16(12-17)15-6-2-1-3-7-15/h1-13,21H,14H2,(H3-,22,23,24,25,26,27)/p+1
n/an/a 2.29E+3n/an/an/an/an/an/a
University of Illinois at Urbana-Champaign
Curated by ChEMBL
Assay Description
Inhibitory activity against Trypanosoma cruzi hexokinase
J Med Chem 49: 215-23 (2006)
Article DOI: 10.1021/jm0582625
BindingDB Entry DOI: 10.7270/Q2BV7G6G