null
SMILES: [Cl-].CCCCCCCCCCCCCO[C@@H](CO)[C@H](O)C[S+]1C[C@@H](O)[C@H](O)[C@H]1CO
InChI Key: InChIKey=YATZMPAPKBNKEY-MMGNNABSSA-M
Activity Spreadsheet -- Enzyme Inhibition Constant Data from BindingDB
Found 3 hits for monomerid = 50180581
Trg + Lig
Ki
nM
ΔG°
kcal/mole
IC50
nM
Kd
nM
EC50/IC50
nM
koff
s-1
kon
M-1s-1
pHTemp
°C
Maltase-glucoamylase
(Homo sapiens (Human))
BDBM50180581
(CHEMBL3814264)
Show SMILES [Cl-].CCCCCCCCCCCCCO[C@@H](CO)[C@H](O)C[S+]1C[C@@H](O)[C@H](O)[C@H]1CO |r|
Show InChI InChI=1S/C22H45O6S.ClH/c1-2-3-4-5-6-7-8-9-10-11-12-13-28-20(14-23)18(25)16-29-17-19(26)22(27)21(29)15-24;/h18-27H,2-17H2,1H3;1H/q+1;/p-1/t18-,19-,20+,21-,22+,29?;/m1./s1
n/an/a 1.10E+3n/an/an/an/an/an/a
Kindai University
Curated by ChEMBL
Assay Description
Inhibition of human small intestine microsomal maltase using maltose as substrate incubated for 30 mins by glucose-oxidase method
Bioorg Med Chem 24: 3705-15 (2016)
BindingDB Entry DOI: 10.7270/Q241700V
Sucrase-isomaltase, intestinal
(Rattus norvegicus (Rat))
BDBM50180581
(CHEMBL3814264)
Show SMILES [Cl-].CCCCCCCCCCCCCO[C@@H](CO)[C@H](O)C[S+]1C[C@@H](O)[C@H](O)[C@H]1CO |r|
Show InChI InChI=1S/C22H45O6S.ClH/c1-2-3-4-5-6-7-8-9-10-11-12-13-28-20(14-23)18(25)16-29-17-19(26)22(27)21(29)15-24;/h18-27H,2-17H2,1H3;1H/q+1;/p-1/t18-,19-,20+,21-,22+,29?;/m1./s1
n/an/a 950n/an/an/an/an/an/a
Kindai University
Curated by ChEMBL
Assay Description
Inhibition of rat small intestinal isomaltase using isomaltose as substrate incubated for 30 mins by glucose-oxidase method
Bioorg Med Chem 24: 3705-15 (2016)
BindingDB Entry DOI: 10.7270/Q241700V
Sucrase-isomaltase, intestinal
(Rattus norvegicus (Rat))
BDBM50180581
(CHEMBL3814264)
Show SMILES [Cl-].CCCCCCCCCCCCCO[C@@H](CO)[C@H](O)C[S+]1C[C@@H](O)[C@H](O)[C@H]1CO |r|
Show InChI InChI=1S/C22H45O6S.ClH/c1-2-3-4-5-6-7-8-9-10-11-12-13-28-20(14-23)18(25)16-29-17-19(26)22(27)21(29)15-24;/h18-27H,2-17H2,1H3;1H/q+1;/p-1/t18-,19-,20+,21-,22+,29?;/m1./s1
n/an/a 1.30E+3n/an/an/an/an/an/a
Kindai University
Curated by ChEMBL
Assay Description
Inhibition of rat small intestinal sucrase using sucrose as substrate incubated for 30 mins by glucose-oxidase method
Bioorg Med Chem 24: 3705-15 (2016)
BindingDB Entry DOI: 10.7270/Q241700V