BDBM50180662 CHEMBL3817944
SMILES: CC[C@H](C)[C@H](NC(=O)[C@@H]1CCCN1C(=O)CNC(=O)[C@H](CO)NC(=O)[C@H](Cc1c[nH]c2ccccc12)NC(=O)[C@H](CCCNC(N)=N)NC(=O)[C@@H]1CCCN1C(=O)[C@H](CC(C)C)NC(=O)[C@@H]1CCCN1C(=O)[C@H](C)N)C(=O)NCC(=O)N[C@@H](C(C)C)C(=O)N[C@@H](CO)C(=O)N[C@@H](Cc1c[nH]c2ccccc12)C(=O)NCC(=O)N[C@@H](CC(C)C)C(=O)N[C@@H](CCCNC(N)=N)C(O)=O
InChI Key: InChIKey=ANBOSJQKVCTUFN-SDTDYBAESA-N
Data: 1 IC50
Activity Spreadsheet -- Enzyme Inhibition Constant Data from BindingDB
Found 1 hit for monomerid = 50180662
Trg + Lig
Ki
nM
ΔG°
kcal/mole
IC50
nM
Kd
nM
EC50/IC50
nM
koff
s-1
kon
M-1s-1
pHTemp
°C
Twik-RElated Potassium (K+) channel 1 (TREK1)
(Homo sapiens (Human))
BDBM50180662
(CHEMBL3817944)
Show SMILES CC[C@H](C)[C@H](NC(=O)[C@@H]1CCCN1C(=O)CNC(=O)[C@H](CO)NC(=O)[C@H](Cc1c[nH]c2ccccc12)NC(=O)[C@H](CCCNC(N)=N)NC(=O)[C@@H]1CCCN1C(=O)[C@H](CC(C)C)NC(=O)[C@@H]1CCCN1C(=O)[C@H](C)N)C(=O)NCC(=O)N[C@@H](C(C)C)C(=O)N[C@@H](CO)C(=O)N[C@@H](Cc1c[nH]c2ccccc12)C(=O)NCC(=O)N[C@@H](CC(C)C)C(=O)N[C@@H](CCCNC(N)=N)C(O)=O |r|
Show InChI InChI=1S/C87H133N25O20/c1-10-48(8)71(81(127)98-41-68(116)108-70(47(6)7)82(128)107-63(44-114)77(123)103-59(36-50-38-95-54-22-13-11-20-52(50)54)72(118)97-40-67(115)100-58(34-45(2)3)75(121)102-57(85(131)132)25-16-30-94-87(91)92)109-80(126)64-26-17-31-110(64)69(117)42-99-73(119)62(43-113)106-76(122)60(37-51-39-96-55-23-14-12-21-53(51)55)104-74(120)56(24-15-29-93-86(89)90)101-78(124)66-28-19-33-112(66)84(130)61(35-46(4)5)105-79(125)65-27-18-32-111(65)83(129)49(9)88/h11-14,20-23,38-39,45-49,56-66,70-71,95-96,113-114H,10,15-19,24-37,40-44,88H2,1-9H3,(H,97,118)(H,98,127)(H,99,119)(H,100,115)(H,101,124)(H,102,121)(H,103,123)(H,104,120)(H,105,125)(H,106,122)(H,107,128)(H,108,116)(H,109,126)(H,131,132)(H4,89,90,93)(H4,91,92,94)/t48-,49-,56-,57-,58-,59-,60-,61-,62-,63-,64-,65-,66-,70-,71-/m0/s1
n/an/a 71n/an/an/an/an/an/a
Universit£ Clermont Auvergne
Curated by ChEMBL
Assay Description
Inhibition of of TREK1 (unknown origin) expressed in whole COS7 cells assessed as reduction in channel currents in presence of 10 uM arachidonic acid
J Med Chem 59: 5149-57 (2016)
BindingDB Entry DOI: 10.7270/Q2319XSS