BDBM50180813 CHEMBL3819599
SMILES: CC(C)(C)C(O)(c1ccc(C#N)c(Cl)c1)C(F)(F)F
InChI Key: InChIKey=FUXMFAORWFAPQB-UHFFFAOYSA-N
Data: 1 EC50
Activity Spreadsheet -- Enzyme Inhibition Constant Data from BindingDB
Found 1 hit for monomerid = 50180813
Trg + Lig
Ki
nM
ΔG°
kcal/mole
IC50
nM
Kd
nM
EC50/IC50
nM
koff
s-1
kon
M-1s-1
pHTemp
°C
Androgen Receptor
(Homo sapiens (Human))
BDBM50180813
(CHEMBL3819599)
Show SMILES CC(C)(C)C(O)(c1ccc(C#N)c(Cl)c1)C(F)(F)F
Show InChI InChI=1S/C13H13ClF3NO/c1-11(2,3)12(19,13(15,16)17)9-5-4-8(7-18)10(14)6-9/h4-6,19H,1-3H3
NCI pathway
Reactome pathway
n/an/an/an/a 158n/an/an/an/a
GlaxoSmithKline
Curated by ChEMBL
Assay Description
Modulation of human androgen receptor expressed in African green monkey CV1 cells after 24 hrs by luciferase reporter gene assay
ACS Med Chem Lett 7: 83-8 (2016)
BindingDB Entry DOI: 10.7270/Q2K35WMN