BDBM50180827 CHEMBL3818723
SMILES: OC(c1ccc(C#N)c(c1)C(F)(F)F)(C(F)(F)F)C(F)(F)F
InChI Key: InChIKey=ZHPARMBRLANIFS-UHFFFAOYSA-N
Data: 1 EC50
Activity Spreadsheet -- Enzyme Inhibition Constant Data from BindingDB
Found 1 hit for monomerid = 50180827
Trg + Lig
Ki
nM
ΔG°
kcal/mole
IC50
nM
Kd
nM
EC50/IC50
nM
koff
s-1
kon
M-1s-1
pHTemp
°C
Androgen Receptor
(Homo sapiens (Human))
BDBM50180827
(CHEMBL3818723)
Show SMILES OC(c1ccc(C#N)c(c1)C(F)(F)F)(C(F)(F)F)C(F)(F)F
Show InChI InChI=1S/C11H4F9NO/c12-9(13,14)7-3-6(2-1-5(7)4-21)8(22,10(15,16)17)11(18,19)20/h1-3,22H
NCI pathway
Reactome pathway
n/an/an/an/a 16n/an/an/an/a
GlaxoSmithKline
Curated by ChEMBL
Assay Description
Modulation of human androgen receptor expressed in African green monkey CV1 cells after 24 hrs by luciferase reporter gene assay
ACS Med Chem Lett 7: 83-8 (2016)
BindingDB Entry DOI: 10.7270/Q2K35WMN