BDBM50181151 3-(N-hydroxyacetamido)-1-(4-methoxyphenyl)propylphosphonic acid::CHEMBL380142
SMILES: COc1ccc(cc1)C(CCN(O)C(C)=O)P(O)(O)=O
InChI Key: InChIKey=WKYGVTJLHPMWIU-UHFFFAOYSA-N
Data: 1 IC50
Activity Spreadsheet -- Enzyme Inhibition Constant Data from BindingDB
Found 1 hit for monomerid = 50181151
Trg + Lig
Ki
nM
ΔG°
kcal/mole
IC50
nM
Kd
nM
EC50/IC50
nM
koff
s-1
kon
M-1s-1
pHTemp
°C
1-deoxy-D-xylulose 5-phosphate reductoisomerase
(Escherichia coli)
BDBM50181151
(3-(N-hydroxyacetamido)-1-(4-methoxyphenyl)propylph...)
Show SMILES COc1ccc(cc1)C(CCN(O)C(C)=O)P(O)(O)=O
Show InChI InChI=1S/C12H18NO6P/c1-9(14)13(15)8-7-12(20(16,17)18)10-3-5-11(19-2)6-4-10/h3-6,12,15H,7-8H2,1-2H3,(H2,16,17,18)
n/an/a 459n/an/an/an/an/an/a
Ghent University
Curated by ChEMBL
Assay Description
Inhibition of recombinant Escherichia coli DXR
Bioorg Med Chem Lett 16: 1888-91 (2006)
Article DOI: 10.1016/j.bmcl.2005.12.082
BindingDB Entry DOI: 10.7270/Q2FJ2GB6