BDBM50181328 CHEMBL207096::N-(5-chlorobenzo[d]oxazol-2-yl)benzenesulfonamide
SMILES: Clc1ccc2oc(NS(=O)(=O)c3ccccc3)nc2c1
InChI Key: InChIKey=AGIHDQSDUKQVDK-UHFFFAOYSA-N
Data: 1 IC50
Activity Spreadsheet -- Enzyme Inhibition Constant Data from BindingDB
Found 1 hit for monomerid = 50181328
Trg + Lig
Ki
nM
ΔG°
kcal/mole
IC50
nM
Kd
nM
EC50/IC50
nM
koff
s-1
kon
M-1s-1
pHTemp
°C
Fructose-1,6-bisphosphatase 1 (FBPase)
(Homo sapiens (Human))
BDBM50181328
(CHEMBL207096 | N-(5-chlorobenzo[d]oxazol-2-yl)benz...)
Show SMILES Clc1ccc2oc(NS(=O)(=O)c3ccccc3)nc2c1
Show InChI InChI=1S/C13H9ClN2O3S/c14-9-6-7-12-11(8-9)15-13(19-12)16-20(17,18)10-4-2-1-3-5-10/h1-8H,(H,15,16)
n/an/a 7.70E+3n/an/an/an/an/an/a
Abbott Laboratories
Curated by ChEMBL
Assay Description
Inhibition of human FBPase1
Bioorg Med Chem Lett 16: 1807-10 (2006)
Article DOI: 10.1016/j.bmcl.2006.01.014
BindingDB Entry DOI: 10.7270/Q2J965ZK