BDBM50181332 2,5-dichloro-N-(7-(3-hydroxyphenyl)-5-methoxybenzo[d]oxazol-2-yl)benzenesulfonamide::CHEMBL205039
SMILES: COc1cc(-c2cccc(O)c2)c2oc(NS(=O)(=O)c3cc(Cl)ccc3Cl)nc2c1
InChI Key: InChIKey=VWDORUMWSDVIEQ-UHFFFAOYSA-N
Data: 1 IC50
Activity Spreadsheet -- Enzyme Inhibition Constant Data from BindingDB
Found 1 hit for monomerid = 50181332
Trg + Lig
Ki
nM
ΔG°
kcal/mole
IC50
nM
Kd
nM
EC50/IC50
nM
koff
s-1
kon
M-1s-1
pHTemp
°C
Fructose-1,6-bisphosphatase 1 (FBPase)
(Homo sapiens (Human))
BDBM50181332
(2,5-dichloro-N-(7-(3-hydroxyphenyl)-5-methoxybenzo...)
Show SMILES COc1cc(-c2cccc(O)c2)c2oc(NS(=O)(=O)c3cc(Cl)ccc3Cl)nc2c1
Show InChI InChI=1S/C20H14Cl2N2O5S/c1-28-14-9-15(11-3-2-4-13(25)7-11)19-17(10-14)23-20(29-19)24-30(26,27)18-8-12(21)5-6-16(18)22/h2-10,25H,1H3,(H,23,24)
n/an/a 1.70E+3n/an/an/an/an/an/a
Abbott Laboratories
Curated by ChEMBL
Assay Description
Inhibition of human FBPase1
Bioorg Med Chem Lett 16: 1807-10 (2006)
Article DOI: 10.1016/j.bmcl.2006.01.014
BindingDB Entry DOI: 10.7270/Q2J965ZK