BDBM50181335 2-bromo-N-(5-chlorobenzo[d]oxazol-2-yl)benzenesulfonamide::CHEMBL381535
SMILES: Clc1ccc2oc(NS(=O)(=O)c3ccccc3Br)nc2c1
InChI Key: InChIKey=ZMIACWCSMIWIOZ-UHFFFAOYSA-N
Data: 1 IC50
Activity Spreadsheet -- Enzyme Inhibition Constant Data from BindingDB
Found 1 hit for monomerid = 50181335
Trg + Lig
Ki
nM
ΔG°
kcal/mole
IC50
nM
Kd
nM
EC50/IC50
nM
koff
s-1
kon
M-1s-1
pHTemp
°C
Fructose-1,6-bisphosphatase 1 (FBPase)
(Homo sapiens (Human))
BDBM50181335
(2-bromo-N-(5-chlorobenzo[d]oxazol-2-yl)benzenesulf...)
Show SMILES Clc1ccc2oc(NS(=O)(=O)c3ccccc3Br)nc2c1
Show InChI InChI=1S/C13H8BrClN2O3S/c14-9-3-1-2-4-12(9)21(18,19)17-13-16-10-7-8(15)5-6-11(10)20-13/h1-7H,(H,16,17)
n/an/a 6.50E+3n/an/an/an/an/an/a
Abbott Laboratories
Curated by ChEMBL
Assay Description
Inhibition of human FBPase1
Bioorg Med Chem Lett 16: 1807-10 (2006)
Article DOI: 10.1016/j.bmcl.2006.01.014
BindingDB Entry DOI: 10.7270/Q2J965ZK