null
SMILES: O=C(NCCCN1CCC2(CCc3ccccc23)CC1)C1CC1c1ccccc1
InChI Key: InChIKey=KEBJTPRYSCTYBB-UHFFFAOYSA-N
Activity Spreadsheet -- Enzyme Inhibition Constant Data from BindingDB
Found 1 hit for monomerid = 50181397
Trg + Lig
Ki
nM
ΔG°
kcal/mole
IC50
nM
Kd
nM
EC50/IC50
nM
koff
s-1
kon
M-1s-1
pHTemp
°C
Nociceptin receptor
(Homo sapiens (Human))
BDBM50181397
(CHEMBL201163 | N-(3-{2,3-dihydrospiro[indene-1,4'-...)
Show SMILES O=C(NCCCN1CCC2(CCc3ccccc23)CC1)C1CC1c1ccccc1
Show InChI InChI=1S/C26H32N2O/c29-25(23-19-22(23)20-7-2-1-3-8-20)27-15-6-16-28-17-13-26(14-18-28)12-11-21-9-4-5-10-24(21)26/h1-5,7-10,22-23H,6,11-19H2,(H,27,29)
Reactome pathway
n/an/a>1.00E+3n/an/an/an/an/an/a
Banyu Tsukuba Research Institute
Curated by ChEMBL
Assay Description
Displacement of [125I]Tyr-nociceptin from cloned human ORL1 expressed in CHO cells
J Med Chem 49: 847-9 (2006)
Article DOI: 10.1021/jm0509851
BindingDB Entry DOI: 10.7270/Q2DJ5F78