BDBM50181428 CHEMBL201925::N-(3-{2,3-dihydrospiro[indene-1,4'-piperidine]-1'-yl}propyl)-2-methyl-1H-indene-1-carboxamide
SMILES: CC1=Cc2ccccc2C1C(=O)NCCCN1CCC2(CCc3ccccc23)CC1
InChI Key: InChIKey=RBZUAUQRSLKNMB-UHFFFAOYSA-N
Data: 1 IC50
Activity Spreadsheet -- Enzyme Inhibition Constant Data from BindingDB
Found 1 hit for monomerid = 50181428
Trg + Lig
Ki
nM
ΔG°
kcal/mole
IC50
nM
Kd
nM
EC50/IC50
nM
koff
s-1
kon
M-1s-1
pHTemp
°C
Nociceptin receptor
(Homo sapiens (Human))
BDBM50181428
(CHEMBL201925 | N-(3-{2,3-dihydrospiro[indene-1,4'-...)
Show SMILES CC1=Cc2ccccc2C1C(=O)NCCCN1CCC2(CCc3ccccc23)CC1 |t:1|
Show InChI InChI=1S/C27H32N2O/c1-20-19-22-8-2-4-9-23(22)25(20)26(30)28-15-6-16-29-17-13-27(14-18-29)12-11-21-7-3-5-10-24(21)27/h2-5,7-10,19,25H,6,11-18H2,1H3,(H,28,30)
Reactome pathway
n/an/a>1.00E+3n/an/an/an/an/an/a
Banyu Tsukuba Research Institute
Curated by ChEMBL
Assay Description
Displacement of [125I]Tyr-nociceptin from cloned human ORL1 expressed in CHO cells
J Med Chem 49: 847-9 (2006)
Article DOI: 10.1021/jm0509851
BindingDB Entry DOI: 10.7270/Q2DJ5F78