null
SMILES: FC(F)(F)c1c(cnn1-c1ccccc1)C(=O)C(=O)NCCCN1CCC2(CCc3ccccc23)CC1
InChI Key: InChIKey=CZWFBIJIVQEVBG-UHFFFAOYSA-N
Activity Spreadsheet -- Enzyme Inhibition Constant Data from BindingDB
Found 1 hit for monomerid = 50181432
Trg + Lig
Ki
nM
ΔG°
kcal/mole
IC50
nM
Kd
nM
EC50/IC50
nM
koff
s-1
kon
M-1s-1
pHTemp
°C
Nociceptin receptor
(Homo sapiens (Human))
BDBM50181432
(CHEMBL202092 | N-(3-{2,3-dihydrospiro[indene-1,4'-...)
Show SMILES FC(F)(F)c1c(cnn1-c1ccccc1)C(=O)C(=O)NCCCN1CCC2(CCc3ccccc23)CC1
Show InChI InChI=1S/C28H29F3N4O2/c29-28(30,31)25-22(19-33-35(25)21-8-2-1-3-9-21)24(36)26(37)32-15-6-16-34-17-13-27(14-18-34)12-11-20-7-4-5-10-23(20)27/h1-5,7-10,19H,6,11-18H2,(H,32,37)
Reactome pathway
n/an/a>1.00E+3n/an/an/an/an/an/a
Banyu Tsukuba Research Institute
Curated by ChEMBL
Assay Description
Displacement of [125I]Tyr-nociceptin from cloned human ORL1 expressed in CHO cells
J Med Chem 49: 847-9 (2006)
Article DOI: 10.1021/jm0509851
BindingDB Entry DOI: 10.7270/Q2DJ5F78