BDBM50181462 1,3-bis(3-iodophenyl)-5-phenyl-2-thioxoimidazolidin-4-one::CHEMBL199410
SMILES: Oc1c(-c2ccccc2)n(-c2cccc(I)c2)c(=S)n1-c1cccc(I)c1
InChI Key: InChIKey=WMXPIHKERNPMAP-UHFFFAOYSA-N
Data: 1 KI  1 EC50
Activity Spreadsheet -- Enzyme Inhibition Constant Data from BindingDB
Found 2 hits for monomerid = 50181462
Trg + Lig
Ki
nM
ΔG°
kcal/mole
IC50
nM
Kd
nM
EC50/IC50
nM
koff
s-1
kon
M-1s-1
pHTemp
°C
Cannabinoid receptor 1
(Homo sapiens (Human))
BDBM50181462
(1,3-bis(3-iodophenyl)-5-phenyl-2-thioxoimidazolidi...)
Show SMILES Oc1c(-c2ccccc2)n(-c2cccc(I)c2)c(=S)n1-c1cccc(I)c1
Show InChI InChI=1S/C21H14I2N2OS/c22-15-8-4-10-17(12-15)24-19(14-6-2-1-3-7-14)20(26)25(21(24)27)18-11-5-9-16(23)13-18/h1-13,26H
NCI pathway
Reactome pathway
692n/an/an/an/an/an/an/an/a
Universit£ catholique de Louvain
Curated by ChEMBL
Assay Description
Displacement of [3H]SR141716A from human CB1 receptor
J Med Chem 49: 872-82 (2006)
Article DOI: 10.1021/jm050484f
BindingDB Entry DOI: 10.7270/Q28916NK
Cannabinoid receptor 1
(Homo sapiens (Human))
BDBM50181462
(1,3-bis(3-iodophenyl)-5-phenyl-2-thioxoimidazolidi...)
Show SMILES Oc1c(-c2ccccc2)n(-c2cccc(I)c2)c(=S)n1-c1cccc(I)c1
Show InChI InChI=1S/C21H14I2N2OS/c22-15-8-4-10-17(12-15)24-19(14-6-2-1-3-7-14)20(26)25(21(24)27)18-11-5-9-16(23)13-18/h1-13,26H
NCI pathway
Reactome pathway
n/an/an/an/a 461n/an/an/an/a
Universit£ catholique de Louvain
Curated by ChEMBL
Assay Description
Potency at human CB1 receptor in a [35S]GTP-gamma-S functional assay
J Med Chem 49: 872-82 (2006)
Article DOI: 10.1021/jm050484f
BindingDB Entry DOI: 10.7270/Q28916NK