BDBM50181505 CHEMBL3819204
SMILES: CCN(C1CN(N=C1c1ccc(Cl)cc1)C(\NCCC1CC1)=N/C#N)C(=O)CO
InChI Key: InChIKey=TYUIWCLYIDJSSB-UHFFFAOYSA-N
Data: 2 IC50
Activity Spreadsheet -- Enzyme Inhibition Constant Data from BindingDB
Found 2 hits for monomerid = 50181505
Trg + Lig
Ki
nM
ΔG°
kcal/mole
IC50
nM
Kd
nM
EC50/IC50
nM
koff
s-1
kon
M-1s-1
pHTemp
°C
Proteinase-activated receptor 1
(Homo sapiens (Human))
BDBM50181505
(CHEMBL3819204)
Show SMILES CCN(C1CN(N=C1c1ccc(Cl)cc1)C(\NCCC1CC1)=N/C#N)C(=O)CO |c:6|
Show InChI InChI=1S/C20H25ClN6O2/c1-2-26(18(29)12-28)17-11-27(20(24-13-22)23-10-9-14-3-4-14)25-19(17)15-5-7-16(21)8-6-15/h5-8,14,17,28H,2-4,9-12H2,1H3,(H,23,24)
n/an/a 40n/an/an/an/an/an/a
BAYER Pharma AG
Curated by ChEMBL
Assay Description
Antagonist activity at PAR1 (unknown origin)
J Med Chem 59: 4578-600 (2016)
BindingDB Entry DOI: 10.7270/Q2RN39S5
N-lysine methyltransferase SMYD2
(Homo sapiens (Human))
BDBM50181505
(CHEMBL3819204)
Show SMILES CCN(C1CN(N=C1c1ccc(Cl)cc1)C(\NCCC1CC1)=N/C#N)C(=O)CO |c:6|
Show InChI InChI=1S/C20H25ClN6O2/c1-2-26(18(29)12-28)17-11-27(20(24-13-22)23-10-9-14-3-4-14)25-19(17)15-5-7-16(21)8-6-15/h5-8,14,17,28H,2-4,9-12H2,1H3,(H,23,24)
n/an/a 8.30E+3n/an/an/an/an/an/a
BAYER Pharma AG
Curated by ChEMBL
Assay Description
Inhibition of full length 6xHis-tagged SMYD2 (unknown origin) expressed in Escherichia coli using Btn-Ahx GSRAHSSHLKSKKGQSTSRH-amide as substrate aft...
J Med Chem 59: 4578-600 (2016)
BindingDB Entry DOI: 10.7270/Q2RN39S5