BDBM50181509 CHEMBL3817930
SMILES: CCN(C1CN(N=C1c1ccc(Cl)cc1)C(\Nc1ccc(F)c(Cl)c1)=N/C#N)C(=O)CO
InChI Key: InChIKey=IINNNJBWTYKOMN-UHFFFAOYSA-N
Data: 2 IC50
Activity Spreadsheet -- Enzyme Inhibition Constant Data from BindingDB
Found 2 hits for monomerid = 50181509
Trg + Lig
Ki
nM
ΔG°
kcal/mole
IC50
nM
Kd
nM
EC50/IC50
nM
koff
s-1
kon
M-1s-1
pHTemp
°C
N-lysine methyltransferase SMYD2
(Homo sapiens (Human))
BDBM50181509
(CHEMBL3817930)
Show SMILES CCN(C1CN(N=C1c1ccc(Cl)cc1)C(\Nc1ccc(F)c(Cl)c1)=N/C#N)C(=O)CO |c:6|
Show InChI InChI=1S/C21H19Cl2FN6O2/c1-2-29(19(32)11-31)18-10-30(28-20(18)13-3-5-14(22)6-4-13)21(26-12-25)27-15-7-8-17(24)16(23)9-15/h3-9,18,31H,2,10-11H2,1H3,(H,26,27)
n/an/a 1.70E+3n/an/an/an/an/an/a
BAYER Pharma AG
Curated by ChEMBL
Assay Description
Inhibition of full length 6xHis-tagged SMYD2 (unknown origin) expressed in Escherichia coli using Btn-Ahx GSRAHSSHLKSKKGQSTSRH-amide as substrate aft...
J Med Chem 59: 4578-600 (2016)
BindingDB Entry DOI: 10.7270/Q2RN39S5
Proteinase-activated receptor 1
(Homo sapiens (Human))
BDBM50181509
(CHEMBL3817930)
Show SMILES CCN(C1CN(N=C1c1ccc(Cl)cc1)C(\Nc1ccc(F)c(Cl)c1)=N/C#N)C(=O)CO |c:6|
Show InChI InChI=1S/C21H19Cl2FN6O2/c1-2-29(19(32)11-31)18-10-30(28-20(18)13-3-5-14(22)6-4-13)21(26-12-25)27-15-7-8-17(24)16(23)9-15/h3-9,18,31H,2,10-11H2,1H3,(H,26,27)
n/an/a 60n/an/an/an/an/an/a
BAYER Pharma AG
Curated by ChEMBL
Assay Description
Antagonist activity at PAR1 (unknown origin)
J Med Chem 59: 4578-600 (2016)
BindingDB Entry DOI: 10.7270/Q2RN39S5