BDBM50181519 CHEMBL3819017
SMILES: Cc1cc(CSc2nc3c(nc(N)[nH]c3=O)[nH]2)ccc1F
InChI Key: InChIKey=TXHHWAFVWZXJEA-UHFFFAOYSA-N
Data: 2 Kd
Activity Spreadsheet -- Enzyme Inhibition Constant Data from BindingDB
Found 2 hits for monomerid = 50181519
Trg + Lig
Ki
nM
ΔG°
kcal/mole
IC50
nM
Kd
nM
EC50/IC50
nM
koff
s-1
kon
M-1s-1
pHTemp
°C
2-amino-4-hydroxy-6-hydroxymethyldihydropteridine pyrophosphokinase
(Escherichia coli (strain K12))
BDBM50181519
(CHEMBL3819017)
Show SMILES Cc1cc(CSc2nc3c(nc(N)[nH]c3=O)[nH]2)ccc1F
Show InChI InChI=1S/C13H12FN5OS/c1-6-4-7(2-3-8(6)14)5-21-13-16-9-10(18-13)17-12(15)19-11(9)20/h2-4H,5H2,1H3,(H4,15,16,17,18,19,20)
n/an/an/a 1.01E+4n/an/an/an/an/a
Monash University
Curated by ChEMBL
Assay Description
Binding affinity to biotinylated Escherichia coli HPPK expressed in Escherichia coli BL21 (DE3) in presence of 1 mM ATP by SPR assay
J Med Chem 59: 5248-63 (2016)
BindingDB Entry DOI: 10.7270/Q2057HWV
2-amino-4-hydroxy-6-hydroxymethyldihydropteridin e pyrophosphokinase
(Staphylococcus aureus)
BDBM50181519
(CHEMBL3819017)
Show SMILES Cc1cc(CSc2nc3c(nc(N)[nH]c3=O)[nH]2)ccc1F
Show InChI InChI=1S/C13H12FN5OS/c1-6-4-7(2-3-8(6)14)5-21-13-16-9-10(18-13)17-12(15)19-11(9)20/h2-4H,5H2,1H3,(H4,15,16,17,18,19,20)
n/an/an/a 3.60E+3n/an/an/an/an/a
Monash University
Curated by ChEMBL
Assay Description
Binding affinity to biotinylated Staphylococcus aureus HPPK in presence of 1 mM ATP by SPR assay
J Med Chem 59: 5248-63 (2016)
BindingDB Entry DOI: 10.7270/Q2057HWV