BDBM50181529 CHEMBL3818941
SMILES: Cc1cccc(CSc2nc3c(nc(N)[nH]c3=O)[nH]2)c1C
InChI Key: InChIKey=FLMGIWDNRKBELS-UHFFFAOYSA-N
Data: 2 Kd
Activity Spreadsheet -- Enzyme Inhibition Constant Data from BindingDB
Found 2 hits for monomerid = 50181529
Trg + Lig
Ki
nM
ΔG°
kcal/mole
IC50
nM
Kd
nM
EC50/IC50
nM
koff
s-1
kon
M-1s-1
pHTemp
°C
2-amino-4-hydroxy-6-hydroxymethyldihydropteridine pyrophosphokinase
(Escherichia coli (strain K12))
BDBM50181529
(CHEMBL3818941)
Show SMILES Cc1cccc(CSc2nc3c(nc(N)[nH]c3=O)[nH]2)c1C
Show InChI InChI=1S/C14H15N5OS/c1-7-4-3-5-9(8(7)2)6-21-14-16-10-11(18-14)17-13(15)19-12(10)20/h3-5H,6H2,1-2H3,(H4,15,16,17,18,19,20)
n/an/an/a 6.10E+3n/an/an/an/an/a
Monash University
Curated by ChEMBL
Assay Description
Binding affinity to biotinylated Escherichia coli HPPK expressed in Escherichia coli BL21 (DE3) in presence of 1 mM ATP by SPR assay
J Med Chem 59: 5248-63 (2016)
BindingDB Entry DOI: 10.7270/Q2057HWV
2-amino-4-hydroxy-6-hydroxymethyldihydropteridin e pyrophosphokinase
(Staphylococcus aureus)
BDBM50181529
(CHEMBL3818941)
Show SMILES Cc1cccc(CSc2nc3c(nc(N)[nH]c3=O)[nH]2)c1C
Show InChI InChI=1S/C14H15N5OS/c1-7-4-3-5-9(8(7)2)6-21-14-16-10-11(18-14)17-13(15)19-12(10)20/h3-5H,6H2,1-2H3,(H4,15,16,17,18,19,20)
n/an/an/a 841n/an/an/an/an/a
Monash University
Curated by ChEMBL
Assay Description
Binding affinity to biotinylated Staphylococcus aureus HPPK in presence of 1 mM ATP by SPR assay
J Med Chem 59: 5248-63 (2016)
BindingDB Entry DOI: 10.7270/Q2057HWV