BDBM50181543 CHEMBL3818008
SMILES: COc1ccc(CSc2nc3c(nc(N)[nH]c3=O)[nH]2)cc1
InChI Key: InChIKey=BHVZVQQBJFXSHM-UHFFFAOYSA-N
Data: 2 Kd
Activity Spreadsheet -- Enzyme Inhibition Constant Data from BindingDB
Found 2 hits for monomerid = 50181543
Trg + Lig
Ki
nM
ΔG°
kcal/mole
IC50
nM
Kd
nM
EC50/IC50
nM
koff
s-1
kon
M-1s-1
pHTemp
°C
2-amino-4-hydroxy-6-hydroxymethyldihydropteridine pyrophosphokinase
(Escherichia coli (strain K12))
BDBM50181543
(CHEMBL3818008)
Show SMILES COc1ccc(CSc2nc3c(nc(N)[nH]c3=O)[nH]2)cc1
Show InChI InChI=1S/C13H13N5O2S/c1-20-8-4-2-7(3-5-8)6-21-13-15-9-10(17-13)16-12(14)18-11(9)19/h2-5H,6H2,1H3,(H4,14,15,16,17,18,19)
n/an/an/a 2.20E+3n/an/an/an/an/a
Monash University
Curated by ChEMBL
Assay Description
Binding affinity to biotinylated Escherichia coli HPPK expressed in Escherichia coli BL21 (DE3) in presence of 1 mM ATP by SPR assay
J Med Chem 59: 5248-63 (2016)
BindingDB Entry DOI: 10.7270/Q2057HWV
2-amino-4-hydroxy-6-hydroxymethyldihydropteridin e pyrophosphokinase
(Staphylococcus aureus)
BDBM50181543
(CHEMBL3818008)
Show SMILES COc1ccc(CSc2nc3c(nc(N)[nH]c3=O)[nH]2)cc1
Show InChI InChI=1S/C13H13N5O2S/c1-20-8-4-2-7(3-5-8)6-21-13-15-9-10(17-13)16-12(14)18-11(9)19/h2-5H,6H2,1H3,(H4,14,15,16,17,18,19)
n/an/an/a 520n/an/an/an/an/a
Monash University
Curated by ChEMBL
Assay Description
Binding affinity to biotinylated Staphylococcus aureus HPPK in presence of 1 mM ATP by SPR assay
J Med Chem 59: 5248-63 (2016)
BindingDB Entry DOI: 10.7270/Q2057HWV