null
SMILES: Oc1c(C2=Nc3ccccc3S(=O)(=O)N2)c(=O)n(CC2CCC2)c2ccccc12
InChI Key: InChIKey=BOMHRRVNFJMMGG-UHFFFAOYSA-N
Activity Spreadsheet -- Enzyme Inhibition Constant Data from BindingDB
Found 2 hits for monomerid = 50181624
Trg + Lig
Ki
nM
ΔG°
kcal/mole
IC50
nM
Kd
nM
EC50/IC50
nM
koff
s-1
kon
M-1s-1
pHTemp
°C
RNA-directed RNA polymerase
(Hepatitis C virus)
BDBM50181624
(1-cyclobutylmethyl-3-(1,1-dioxo-1,2-dihydrobenzo[1...)
Show SMILES Oc1c(C2=Nc3ccccc3S(=O)(=O)N2)c(=O)n(CC2CCC2)c2ccccc12 |t:3|
Show InChI InChI=1S/C21H19N3O4S/c25-19-14-8-1-3-10-16(14)24(12-13-6-5-7-13)21(26)18(19)20-22-15-9-2-4-11-17(15)29(27,28)23-20/h1-4,8-11,13,25H,5-7,12H2,(H,22,23)
n/an/an/an/a 241n/an/an/an/a
GlaxoSmithKline
Curated by ChEMBL
Assay Description
Inhibition of HCV RNA replication in Huh7 cells
J Med Chem 49: 971-83 (2006)
Article DOI: 10.1021/jm050855s
BindingDB Entry DOI: 10.7270/Q2N29WJJ
RNA-directed RNA polymerase
(Hepatitis C virus)
BDBM50181624
(1-cyclobutylmethyl-3-(1,1-dioxo-1,2-dihydrobenzo[1...)
Show SMILES Oc1c(C2=Nc3ccccc3S(=O)(=O)N2)c(=O)n(CC2CCC2)c2ccccc12 |t:3|
Show InChI InChI=1S/C21H19N3O4S/c25-19-14-8-1-3-10-16(14)24(12-13-6-5-7-13)21(26)18(19)20-22-15-9-2-4-11-17(15)29(27,28)23-20/h1-4,8-11,13,25H,5-7,12H2,(H,22,23)
n/an/a 49n/an/an/an/an/an/a
GlaxoSmithKline
Curated by ChEMBL
Assay Description
Inhibitory activity against HCV delta 21 NS5B RNA polymerase by SPA assay
J Med Chem 49: 971-83 (2006)
Article DOI: 10.1021/jm050855s
BindingDB Entry DOI: 10.7270/Q2N29WJJ