null
SMILES: CN(C)CC[C@@H](CSc1ccccc1)Nc1ccc(cc1[N+]([O-])=O)S(=O)(=O)NC(=O)c1ccc(cc1)N1CCC(C)(C)CC1
InChI Key: InChIKey=DWEHITNKTMMZBR-VWLOTQADSA-N
Activity Spreadsheet -- Enzyme Inhibition Constant Data from BindingDB
Found 5 hits for monomerid = 50181867
Trg + Lig
Ki
nM
ΔG°
kcal/mole
IC50
nM
Kd
nM
EC50/IC50
nM
koff
s-1
kon
M-1s-1
pHTemp
°C
Bcl-2-like protein 1
(Homo sapiens (Human))
BDBM50181867
(4-((S)-3-dimethylamino-1-phenylsulfanylmethylpropy...)
Show SMILES CN(C)CC[C@@H](CSc1ccccc1)Nc1ccc(cc1[N+]([O-])=O)S(=O)(=O)NC(=O)c1ccc(cc1)N1CCC(C)(C)CC1
Show InChI InChI=1S/C32H41N5O5S2/c1-32(2)17-20-36(21-18-32)26-12-10-24(11-13-26)31(38)34-44(41,42)28-14-15-29(30(22-28)37(39)40)33-25(16-19-35(3)4)23-43-27-8-6-5-7-9-27/h5-15,22,25,33H,16-21,23H2,1-4H3,(H,34,38)/t25-/m0/s1
NCI pathway
Reactome pathway
n/an/an/an/a 9.50E+3n/an/an/an/a
Abbott Laboratories
Curated by ChEMBL
Assay Description
Activity towards mouse FL5.12 cell line transfected with Bcl-XL in presence of gelatin
J Med Chem 49: 1165-81 (2006)
Article DOI: 10.1021/jm050754u
BindingDB Entry DOI: 10.7270/Q2VM4BT0
Bcl-2-like protein 1
(Homo sapiens (Human))
BDBM50181867
(4-((S)-3-dimethylamino-1-phenylsulfanylmethylpropy...)
Show SMILES CN(C)CC[C@@H](CSc1ccccc1)Nc1ccc(cc1[N+]([O-])=O)S(=O)(=O)NC(=O)c1ccc(cc1)N1CCC(C)(C)CC1
Show InChI InChI=1S/C32H41N5O5S2/c1-32(2)17-20-36(21-18-32)26-12-10-24(11-13-26)31(38)34-44(41,42)28-14-15-29(30(22-28)37(39)40)33-25(16-19-35(3)4)23-43-27-8-6-5-7-9-27/h5-15,22,25,33H,16-21,23H2,1-4H3,(H,34,38)/t25-/m0/s1
NCI pathway
Reactome pathway
n/an/an/an/a 1.61E+4n/an/an/an/a
Abbott Laboratories
Curated by ChEMBL
Assay Description
Activity towards mouse FL5.12 cell line transfected with Bcl-XL in presence of 3% fetal bovine serum
J Med Chem 49: 1165-81 (2006)
Article DOI: 10.1021/jm050754u
BindingDB Entry DOI: 10.7270/Q2VM4BT0
Apoptosis regulator Bcl-2
(Homo sapiens (Human))
BDBM50181867
(4-((S)-3-dimethylamino-1-phenylsulfanylmethylpropy...)
Show SMILES CN(C)CC[C@@H](CSc1ccccc1)Nc1ccc(cc1[N+]([O-])=O)S(=O)(=O)NC(=O)c1ccc(cc1)N1CCC(C)(C)CC1
Show InChI InChI=1S/C32H41N5O5S2/c1-32(2)17-20-36(21-18-32)26-12-10-24(11-13-26)31(38)34-44(41,42)28-14-15-29(30(22-28)37(39)40)33-25(16-19-35(3)4)23-43-27-8-6-5-7-9-27/h5-15,22,25,33H,16-21,23H2,1-4H3,(H,34,38)/t25-/m0/s1
1.26E+3n/an/an/an/an/an/an/an/a
Abbott Laboratories
Curated by ChEMBL
Assay Description
Binding affinity to Bcl2 by fluorescence polarization assay
J Med Chem 49: 1165-81 (2006)
Article DOI: 10.1021/jm050754u
BindingDB Entry DOI: 10.7270/Q2VM4BT0
Bcl-2-like protein 1
(Homo sapiens (Human))
BDBM50181867
(4-((S)-3-dimethylamino-1-phenylsulfanylmethylpropy...)
Show SMILES CN(C)CC[C@@H](CSc1ccccc1)Nc1ccc(cc1[N+]([O-])=O)S(=O)(=O)NC(=O)c1ccc(cc1)N1CCC(C)(C)CC1
Show InChI InChI=1S/C32H41N5O5S2/c1-32(2)17-20-36(21-18-32)26-12-10-24(11-13-26)31(38)34-44(41,42)28-14-15-29(30(22-28)37(39)40)33-25(16-19-35(3)4)23-43-27-8-6-5-7-9-27/h5-15,22,25,33H,16-21,23H2,1-4H3,(H,34,38)/t25-/m0/s1
NCI pathway
Reactome pathway
3.85E+3n/an/an/an/an/an/an/an/a
Abbott Laboratories
Curated by ChEMBL
Assay Description
Binding affinity to Bcl-XL in 1% human serum by fluorescence polarization assay
J Med Chem 49: 1165-81 (2006)
Article DOI: 10.1021/jm050754u
BindingDB Entry DOI: 10.7270/Q2VM4BT0
Bcl-2-like protein 1
(Homo sapiens (Human))
BDBM50181867
(4-((S)-3-dimethylamino-1-phenylsulfanylmethylpropy...)
Show SMILES CN(C)CC[C@@H](CSc1ccccc1)Nc1ccc(cc1[N+]([O-])=O)S(=O)(=O)NC(=O)c1ccc(cc1)N1CCC(C)(C)CC1
Show InChI InChI=1S/C32H41N5O5S2/c1-32(2)17-20-36(21-18-32)26-12-10-24(11-13-26)31(38)34-44(41,42)28-14-15-29(30(22-28)37(39)40)33-25(16-19-35(3)4)23-43-27-8-6-5-7-9-27/h5-15,22,25,33H,16-21,23H2,1-4H3,(H,34,38)/t25-/m0/s1
NCI pathway
Reactome pathway
252n/an/an/an/an/an/an/an/a
Abbott Laboratories
Curated by ChEMBL
Assay Description
Binding affinity to Bcl-XL by fluorescence polarization assay
J Med Chem 49: 1165-81 (2006)
Article DOI: 10.1021/jm050754u
BindingDB Entry DOI: 10.7270/Q2VM4BT0