BDBM50181930 2-(4-(3,4-dichlorobenzyloxy)phenyl)-1-cyclopentyl-1H-benzo[d]imidazole-5-carboxylic acid::CHEMBL204932
SMILES: OC(=O)c1ccc2n(C3CCCC3)c(nc2c1)-c1ccc(OCc2ccc(Cl)c(Cl)c2)cc1
InChI Key: InChIKey=ZMTSLLYEGJFCFO-UHFFFAOYSA-N
Data: 1 IC50
Activity Spreadsheet -- Enzyme Inhibition Constant Data from BindingDB
Found 1 hit for monomerid = 50181930
Trg + Lig
Ki
nM
ΔG°
kcal/mole
IC50
nM
Kd
nM
EC50/IC50
nM
koff
s-1
kon
M-1s-1
pHTemp
°C
Hepatitis C virus NS5B RNA-dependent RNA polymerase
(Hepatitis C virus)
BDBM50181930
(2-(4-(3,4-dichlorobenzyloxy)phenyl)-1-cyclopentyl-...)
Show SMILES OC(=O)c1ccc2n(C3CCCC3)c(nc2c1)-c1ccc(OCc2ccc(Cl)c(Cl)c2)cc1
Show InChI InChI=1S/C26H22Cl2N2O3/c27-21-11-5-16(13-22(21)28)15-33-20-9-6-17(7-10-20)25-29-23-14-18(26(31)32)8-12-24(23)30(25)19-3-1-2-4-19/h5-14,19H,1-4,15H2,(H,31,32)
n/an/a 1.30E+3n/an/an/an/an/an/a
Central Pharmaceutical Research Institute
Curated by ChEMBL
Assay Description
Inhibitory activity against HCV 1b NS5B RNA dependent RNA polymerase
Bioorg Med Chem Lett 16: 1859-63 (2006)
Article DOI: 10.1016/j.bmcl.2006.01.032
BindingDB Entry DOI: 10.7270/Q2BK1BX6