BDBM50181931 2-(4-(benzyloxy)phenyl)-1-cycloheptyl-1H-benzo[d]imidazole-5-carboxylic acid::CHEMBL204620
SMILES: OC(=O)c1ccc2n(C3CCCCCC3)c(nc2c1)-c1ccc(OCc2ccccc2)cc1
InChI Key: InChIKey=PDWJODSDNBTHDY-UHFFFAOYSA-N
Data: 1 IC50
Activity Spreadsheet -- Enzyme Inhibition Constant Data from BindingDB
Found 1 hit for monomerid = 50181931
Trg + Lig
Ki
nM
ΔG°
kcal/mole
IC50
nM
Kd
nM
EC50/IC50
nM
koff
s-1
kon
M-1s-1
pHTemp
°C
Hepatitis C virus NS5B RNA-dependent RNA polymerase
(Hepatitis C virus)
BDBM50181931
(2-(4-(benzyloxy)phenyl)-1-cycloheptyl-1H-benzo[d]i...)
Show SMILES OC(=O)c1ccc2n(C3CCCCCC3)c(nc2c1)-c1ccc(OCc2ccccc2)cc1
Show InChI InChI=1S/C28H28N2O3/c31-28(32)22-14-17-26-25(18-22)29-27(30(26)23-10-6-1-2-7-11-23)21-12-15-24(16-13-21)33-19-20-8-4-3-5-9-20/h3-5,8-9,12-18,23H,1-2,6-7,10-11,19H2,(H,31,32)
n/an/a 1.80E+3n/an/an/an/an/an/a
Central Pharmaceutical Research Institute
Curated by ChEMBL
Assay Description
Inhibitory activity against HCV 1b NS5B RNA dependent RNA polymerase
Bioorg Med Chem Lett 16: 1859-63 (2006)
Article DOI: 10.1016/j.bmcl.2006.01.032
BindingDB Entry DOI: 10.7270/Q2BK1BX6