BDBM50181939 2-(4-(3,5-dichlorobenzyloxy)phenyl)-1-cyclopentyl-1H-benzo[d]imidazole-5-carboxylic acid::CHEMBL206019
SMILES: OC(=O)c1ccc2n(C3CCCC3)c(nc2c1)-c1ccc(OCc2cc(Cl)cc(Cl)c2)cc1
InChI Key: InChIKey=PZXOQECTQXFFIR-UHFFFAOYSA-N
Data: 1 IC50
Activity Spreadsheet -- Enzyme Inhibition Constant Data from BindingDB
Found 1 hit for monomerid = 50181939
Trg + Lig
Ki
nM
ΔG°
kcal/mole
IC50
nM
Kd
nM
EC50/IC50
nM
koff
s-1
kon
M-1s-1
pHTemp
°C
Hepatitis C virus NS5B RNA-dependent RNA polymerase
(Hepatitis C virus)
BDBM50181939
(2-(4-(3,5-dichlorobenzyloxy)phenyl)-1-cyclopentyl-...)
Show SMILES OC(=O)c1ccc2n(C3CCCC3)c(nc2c1)-c1ccc(OCc2cc(Cl)cc(Cl)c2)cc1
Show InChI InChI=1S/C26H22Cl2N2O3/c27-19-11-16(12-20(28)14-19)15-33-22-8-5-17(6-9-22)25-29-23-13-18(26(31)32)7-10-24(23)30(25)21-3-1-2-4-21/h5-14,21H,1-4,15H2,(H,31,32)
n/an/a 1.70E+3n/an/an/an/an/an/a
Central Pharmaceutical Research Institute
Curated by ChEMBL
Assay Description
Inhibitory activity against HCV 1b NS5B RNA dependent RNA polymerase
Bioorg Med Chem Lett 16: 1859-63 (2006)
Article DOI: 10.1016/j.bmcl.2006.01.032
BindingDB Entry DOI: 10.7270/Q2BK1BX6