BDBM50181940 2-(4-(4-tert-butylbenzyloxy)phenyl)-1-cyclopentyl-1H-benzo[d]imidazole-5-carboxylic acid::CHEMBL381784
SMILES: CC(C)(C)c1ccc(COc2ccc(cc2)-c2nc3cc(ccc3n2C2CCCC2)C(O)=O)cc1
InChI Key: InChIKey=RLHXICZHLJYXDT-UHFFFAOYSA-N
Data: 1 IC50
Activity Spreadsheet -- Enzyme Inhibition Constant Data from BindingDB
Found 1 hit for monomerid = 50181940
Trg + Lig
Ki
nM
ΔG°
kcal/mole
IC50
nM
Kd
nM
EC50/IC50
nM
koff
s-1
kon
M-1s-1
pHTemp
°C
Hepatitis C virus NS5B RNA-dependent RNA polymerase
(Hepatitis C virus)
BDBM50181940
(2-(4-(4-tert-butylbenzyloxy)phenyl)-1-cyclopentyl-...)
Show SMILES CC(C)(C)c1ccc(COc2ccc(cc2)-c2nc3cc(ccc3n2C2CCCC2)C(O)=O)cc1
Show InChI InChI=1S/C30H32N2O3/c1-30(2,3)23-13-8-20(9-14-23)19-35-25-15-10-21(11-16-25)28-31-26-18-22(29(33)34)12-17-27(26)32(28)24-6-4-5-7-24/h8-18,24H,4-7,19H2,1-3H3,(H,33,34)
n/an/a 1.50E+3n/an/an/an/an/an/a
Central Pharmaceutical Research Institute
Curated by ChEMBL
Assay Description
Inhibitory activity against HCV 1b NS5B RNA dependent RNA polymerase
Bioorg Med Chem Lett 16: 1859-63 (2006)
Article DOI: 10.1016/j.bmcl.2006.01.032
BindingDB Entry DOI: 10.7270/Q2BK1BX6