BDBM50181950 2-(4-(benzyloxy)phenyl)-1-cyclohexyl-1H-benzo[d]imidazole-5-carboxylic acid::CHEMBL379677
SMILES: OC(=O)c1ccc2n(C3CCCCC3)c(nc2c1)-c1ccc(OCc2ccccc2)cc1
InChI Key: InChIKey=GWCTUYUNVJTNJR-UHFFFAOYSA-N
Data: 2 IC50
Activity Spreadsheet -- Enzyme Inhibition Constant Data from BindingDB
Found 2 hits for monomerid = 50181950
Trg + Lig
Ki
nM
ΔG°
kcal/mole
IC50
nM
Kd
nM
EC50/IC50
nM
koff
s-1
kon
M-1s-1
pHTemp
°C
Hepatitis C virus NS5B RNA-dependent RNA polymerase
(Hepatitis C virus)
BDBM50181950
(2-(4-(benzyloxy)phenyl)-1-cyclohexyl-1H-benzo[d]im...)
Show SMILES OC(=O)c1ccc2n(C3CCCCC3)c(nc2c1)-c1ccc(OCc2ccccc2)cc1
Show InChI InChI=1S/C27H26N2O3/c30-27(31)21-13-16-25-24(17-21)28-26(29(25)22-9-5-2-6-10-22)20-11-14-23(15-12-20)32-18-19-7-3-1-4-8-19/h1,3-4,7-8,11-17,22H,2,5-6,9-10,18H2,(H,30,31)
n/an/a 1.40E+3n/an/an/an/an/an/a
Central Pharmaceutical Research Institute
Curated by ChEMBL
Assay Description
Inhibition of HCV NS5B RNA polymerase
J Med Chem 49: 6950-3 (2006)
Article DOI: 10.1021/jm0610245
BindingDB Entry DOI: 10.7270/Q2XD12GM
Hepatitis C virus NS5B RNA-dependent RNA polymerase
(Hepatitis C virus)
BDBM50181950
(2-(4-(benzyloxy)phenyl)-1-cyclohexyl-1H-benzo[d]im...)
Show SMILES OC(=O)c1ccc2n(C3CCCCC3)c(nc2c1)-c1ccc(OCc2ccccc2)cc1
Show InChI InChI=1S/C27H26N2O3/c30-27(31)21-13-16-25-24(17-21)28-26(29(25)22-9-5-2-6-10-22)20-11-14-23(15-12-20)32-18-19-7-3-1-4-8-19/h1,3-4,7-8,11-17,22H,2,5-6,9-10,18H2,(H,30,31)
n/an/a 1.40E+3n/an/an/an/an/an/a
Central Pharmaceutical Research Institute
Curated by ChEMBL
Assay Description
Inhibitory activity against HCV 1b NS5B RNA dependent RNA polymerase
Bioorg Med Chem Lett 16: 1859-63 (2006)
Article DOI: 10.1016/j.bmcl.2006.01.032
BindingDB Entry DOI: 10.7270/Q2BK1BX6