null
SMILES: COc1cc(Nc2ncc3CCCN(c4ccccn4)c3n2)cc(OC)c1OC
InChI Key: InChIKey=VJBNZXSYAZLKKN-UHFFFAOYSA-N
Activity Spreadsheet -- Enzyme Inhibition Constant Data from BindingDB
Found 1 hit for monomerid = 50181975
Trg + Lig
Ki
nM
ΔG°
kcal/mole
IC50
nM
Kd
nM
EC50/IC50
nM
koff
s-1
kon
M-1s-1
pHTemp
°C
Focal adhesion kinase 1
(Homo sapiens (Human))
BDBM50181975
(8-(pyridin-2-yl)-N-(3,4,5-trimethoxyphenyl)-5,6,7,...)
Show SMILES COc1cc(Nc2ncc3CCCN(c4ccccn4)c3n2)cc(OC)c1OC
Show InChI InChI=1S/C21H23N5O3/c1-27-16-11-15(12-17(28-2)19(16)29-3)24-21-23-13-14-7-6-10-26(20(14)25-21)18-8-4-5-9-22-18/h4-5,8-9,11-13H,6-7,10H2,1-3H3,(H,23,24,25)
NCI pathway
Reactome pathway
n/an/a 200n/an/an/an/an/an/a
Genomics Institute of the Novartis Research Foundation (GNF)
Curated by ChEMBL
Assay Description
Inhibitory activity against FAK
Bioorg Med Chem Lett 16: 2173-6 (2006)
Article DOI: 10.1016/j.bmcl.2006.01.053
BindingDB Entry DOI: 10.7270/Q2319VGX